TriboDataFAIR Ontology
type: Ontology
creator: Nikolay Garabedian, Ph.D.
description: TriboDataFAIR Ontology represents the metadata necessary for various laboratory procedures to be fully reproducible. WIth vocabulary listed for each class and the relevant object properties define a framework for using an electronic lab notebook in the collection of metadata.
rights: This work is licensed under a Creative Commons Attribution 4.0 International License. http://creativecommons.org/licenses/by/4.0/
comment: For the latest version of the ontology, please visit: https://github.com/nick-garabedian/TriboDataFAIR-Ontology/
comment: Ontology Maintenance and Engineering: Nikolay Garabedian, Ph.D. Domain Knowledge Source: TriboData Team at IAM-CMS at KIT, Karlsruhe, Germany

contextualType
type: AnnotationProperty
comment: The entity which identifies the most suitable type to be qualified as when creating a digital record.
definition origin: TriboData Team at IAM-CMS at KIT, Karlsruhe, Germany
persistent ID: TDO:3000103

definitionOrigin
type: AnnotationProperty
comment: The entity where the particular resource and its definition were found or first described.
definition origin: TriboData Team at IAM-CMS at KIT, Karlsruhe, Germany
persistent ID: TDO:3000102

friendlyName
type: AnnotationProperty
comment: The name which appears in user-friendly (non-ontological) interfaces.
definition origin: TriboData Team at IAM-CMS at KIT, Karlsruhe, Germany
persistent ID: TDO:3000101

persistentID
type: AnnotationProperty
comment: The unique identifier that stays unchanged in any version of the ontology. It is meant to help identify resources when their hierarchical place in the ontology is updated. The first three characters of the ID are "TDO" which stands for Tribo-Data-Ontology. First Digit Meanings: 0xxxxxx : Class 1xxxxxx : Object property 2xxxxxx : Data property 3xxxxxx : Annotation property
definition origin: TriboData Team at IAM-CMS at KIT, Karlsruhe, Germany
persistent ID: TDO:3000100

characterizesSpecimen
type: ObjectProperty
sub property of: involves
comment: This property relates a scientific process to the specimen of interest.
definition origin: TriboData Team at IAM-CMS at KIT, Karlsruhe, Germany
friendly name: characterizesSpecimen
persistent ID: TDO:1000112

documentsDescriptionOf
type: ObjectProperty
comment: This property relates an object's ability to store information about the description of another object.
definition origin: TriboData Team at IAM-CMS at KIT, Karlsruhe, Germany
friendly name: documentsDescriptionOf
persistent ID: TDO:1000100

employsEquipment
type: ObjectProperty
sub property of: involves
comment: This property relates a scientific process to the equipment which enables its execution.
definition origin: TriboData Team at IAM-CMS at KIT, Karlsruhe, Germany
friendly name: employsEquipment
persistent ID: TDO:1000113

generates
type: ObjectProperty
definition origin: TriboData Team at IAM-CMS at KIT, Karlsruhe, Germany
persistent ID: TDO:1000101

generatesFile
type: ObjectProperty
sub property of: generates
comment: This property indicates the production of a file in a scientific process.
definition origin: TriboData Team at IAM-CMS at KIT, Karlsruhe, Germany
friendly name: generatesFile
persistent ID: TDO:1000102

hasFilesWithMetadata
type: ObjectProperty
sub property of: hasPart
comment: This property indicates the production of metadate in a scientific process assiciated with the production of data in a file.
definition origin: TriboData Team at IAM-CMS at KIT, Karlsruhe, Germany
friendly name: hasFilesWithMetadata
persistent ID: TDO:1000103

hasIdentifier
type: ObjectProperty
sub property of: hasAttribute
comment: This property relates an object to its unique description.
definition origin: TriboData Team at IAM-CMS at KIT, Karlsruhe, Germany
friendly name: hasIdentifier
persistent ID: TDO:1000104

hasPhysicalUnit
type: ObjectProperty
sub property of: hasAttribute
comment: This property relates a magnitude to its defining/quantifying unit.
definition origin: TriboData Team at IAM-CMS at KIT, Karlsruhe, Germany
friendly name: hasUnit
persistent ID: TDO:1000105

hasQuantification
type: ObjectProperty
sub property of: hasAttribute
comment: This property relates an object to its magnitude.
definition origin: TriboData Team at IAM-CMS at KIT, Karlsruhe, Germany
friendly name: hasQuantification
persistent ID: TDO:1000106

hasSummary
type: ObjectProperty
sub property of: hasAttribute
comment: This property relates an object to information that could be derived from other already included records. One of the attribute of this object property is that it does not deal with raw data.
definition origin: TriboData Team at IAM-CMS at KIT, Karlsruhe, Germany
friendly name: hasSummary
persistent ID: TDO:1000107

hasTechnicalSpecification
type: ObjectProperty
comment: This property relates a scientific object to its specifications, which indicate its potential use.
definition origin: TriboData Team at IAM-CMS at KIT, Karlsruhe, Germany
friendly name: hasTechnicalSpecification
persistent ID: TDO:1000110

involves
type: ObjectProperty
comment: This superclass of object properties involves objects of defined classes.
definition origin: TriboData Team at IAM-CMS at KIT, Karlsruhe, Germany
persistent ID: TDO:1000111

is1000Of
type: ObjectProperty
sub property of: hasProportionality
comment: This property relates an object to another object, which is 1/1000 of it's magnitude. The conversion of one object to another with this property is through the mathematical operation of multiplication.
definition origin: TriboData Team at IAM-CMS at KIT, Karlsruhe, Germany
friendly name: is1000Of
persistent ID: TDO:1000109

isComprisedOf
type: ObjectProperty
sub property of: hasPart
comment: This property relates an information collective to its subparts. For example, a list of groceries isComprisedOf "edibles" and "non-edibles".
comment: Tris property does not have a "has" prefix because the English word "comprise" does not have an associated noun.
definition origin: TriboData Team at IAM-CMS at KIT, Karlsruhe, Germany
friendly name: isComprisedOf
persistent ID: TDO:1000108

isControlledBy
type: ObjectProperty
comment: This property relates a scientific process to the objects (could be variables) which (could) influence the outcome of the experiment.
definition origin: TriboData Team at IAM-CMS at KIT, Karlsruhe, Germany
friendly name: isControlledBy
persistent ID: TDO:1000120

makesUseOfConsumable
type: ObjectProperty
sub property of: involves
comment: This property relates a scientific process to an object which supports the process, but is readily replasable during or after the process, as it its fuction detiriorates over time.
definition origin: TriboData Team at IAM-CMS at KIT, Karlsruhe, Germany
friendly name: makesUseOfConsumable
persistent ID: TDO:1000114

physicallyModifies
type: ObjectProperty
sub property of: involves
comment: This property relates a scientific process to the objects which are physically influenced temporarily (elastically), or permanently (plastically).
definition origin: TriboData Team at IAM-CMS at KIT, Karlsruhe, Germany
friendly name: physicallyModifies
persistent ID: TDO:1000115

physicallyResultsIn
type: ObjectProperty
sub property of: involves
comment: This property relates a scientific process to the objects which are physically incepted as a result of it, as combination of other objects, or as subparts of other objects.
definition origin: TriboData Team at IAM-CMS at KIT, Karlsruhe, Germany
friendly name: physicallyResultsIn
persistent ID: TDO:1000118

stressesAsBaseBody
type: ObjectProperty
sub property of: physicallyModifies
comment: A clear definition of what is to be called "base body" and what "counter body" in a tribologcial system does not exist. We therefore will use the following set of definitions — whereby always the first applicable definition should be used in a given case (going through the list from top to bottom): The Base body in a model experiment is the sample or body... ...whose nominal contact area is not permanently tribologically stressed during the experiment. ...that is larger. ...expected to show less wear at the end of the experiment. ...that is static during the experiment.
definition origin: TriboData Team at IAM-CMS at KIT, Karlsruhe, Germany
friendly name: stressesAsBaseBody
persistent ID: TDO:1000116

stressesAsCounterBody
type: ObjectProperty
sub property of: physicallyModifies
comment: A clear definition of what is to be called "base body" and what "counter body" in a tribologcial system does not exist. We therefore will use the following set of definitions — whereby always the first applicable definition should be used in a given case (going through the list from top to bottom): The counter body in a model experiment is the sample or body... ...whose nominal contact area is permanently tribologically stressed during the experiment. ...that is smaller. ...expected to show more wear at the end of the experiment. ...that is moving during the experiment.
definition origin: TriboData Team at IAM-CMS at KIT, Karlsruhe, Germany
friendly name: stressesAsConterBody
persistent ID: TDO:1000117

takesDataFromProcess
type: ObjectProperty
sub property of: involves
comment: This property relates a data manipulation process to the process that generated the data needed to be supplied for its excution.
definition origin: TriboData Team at IAM-CMS at KIT, Karlsruhe, Germany
friendly name: takesDataFromProcess
persistent ID: TDO:1000119

hasBoolean
type: DatatypeProperty
sub property of: hasValue
range: boolean
definition origin: TriboData Team at IAM-CMS at KIT, Karlsruhe, Germany
persistent ID: TDO:2000100

hasCount
type: DatatypeProperty
sub property of: hasValue
definition origin: TriboData Team at IAM-CMS at KIT, Karlsruhe, Germany
persistent ID: TDO:2000101

hasFloorNumber
type: DatatypeProperty
sub property of: hasCount
range: integer
definition origin: TriboData Team at IAM-CMS at KIT, Karlsruhe, Germany
persistent ID: TDO:2000102

hasRationalNumberValue
type: DatatypeProperty
sub property of: hasValue
range: float
definition origin: TriboData Team at IAM-CMS at KIT, Karlsruhe, Germany
persistent ID: TDO:2000103

hasText
type: DatatypeProperty
sub property of: hasValue
range: string
definition origin: TriboData Team at IAM-CMS at KIT, Karlsruhe, Germany
persistent ID: TDO:2000104

hasTimeStamp
type: DatatypeProperty
sub property of: hasValue
range: dateTimeStamp
definition origin: TriboData Team at IAM-CMS at KIT, Karlsruhe, Germany
persistent ID: TDO:2000105

AOFactorSetpoint
type: Class
subclass of: TribologicalExperimentSetting
subclass of: Restriction
  on property: hasQuantification
  some values from: UnitlessQuantitySetpointMagnitude
comment: Analog Output proportionality factor.
definition origin: TriboData Team at IAM-CMS at KIT, Karlsruhe, Germany
friendly name: AO Factor
persistent ID: TDO:0000321

AOOffsetSetpoint
type: Class
subclass of: TribologicalExperimentSetting
subclass of: Restriction
  on property: hasQuantification
  some values from: UnitlessQuantitySetpointMagnitude
comment: Analog Output offset amount.
definition origin: TriboData Team at IAM-CMS at KIT, Karlsruhe, Germany
friendly name: AO Offset
persistent ID: TDO:0000322

AbrasiveMaterialType
type: Class
subclass of: ClassificationCategory
comment: Instances of this class specify the abrasive material that a grinding tool is made of. This refers to the material doing the actual grinding, not the bond (if there is any).
definition origin: TriboData Team at IAM-CMS at KIT, Karlsruhe, Germany
friendly name: Abrasive Material Type
persistent ID: TDO:0000102

Abstract
type: Class
subclass of: Entity
comment: Properties or qualities as distinguished from any particular embodiment of the properties/qualities in a physical medium. Instances of Abstract can be said to exist in the same sense as mathematical objects such as sets and relations, but they cannot exist at a particular place and time without some physical encoding or embodiment.
definition origin: SUMO Ontology (http://www.adampease.org/OP)

AngleSetpointMagnitude
type: Class
subclass of: SetpointQuantity
subclass of: Restriction
  on property: hasPhysicalUnit
  some values from: AngleUnit
subclass of: Restriction
  on property: hasRationalNumberValue
  some values from: float
comment: The physical quantity that characterizes the phenomenon called angle.
definition origin: TriboData Team at IAM-CMS at KIT, Karlsruhe, Germany
friendly name: Angle Setpoint Magnitude
persistent ID: TDO:0000372

AngleUnit
type: Class
subclass of: ConversionTargetUnit
subclass of: PhysicalQuantityUnit
comment: The unit that locks the meaning of the amount of the phenomenon of angle between two rotations.
definition origin: TriboData Team at IAM-CMS at KIT, Karlsruhe, Germany
friendly name: Angular Velocity Unit
persistent ID: TDO:0000105

AngularOffsetBetweenMeasuredProfiles
type: Class
subclass of: SurfaceProfilometrySetting
subclass of: Restriction
  on property: hasQuantification
  some values from: AngleSetpointMagnitude
comment: Instances of this class characterize the measurement offset in radial-direction when multiple profiles from the same sample are taken.
definition origin: TriboData Team at IAM-CMS at KIT, Karlsruhe, Germany
friendly name: Angular Offset Between Profiles
persistent ID: TDO:0000312

AngularVelocitySetpointMagnitude
type: Class
subclass of: SetpointQuantity
subclass of: Restriction
  on property: hasPhysicalUnit
  some values from: AngularVelocityUnit
subclass of: Restriction
  on property: hasRationalNumberValue
  some values from: float
comment: The physical quantity that characterizes the phenomenon called angular velocity.
definition origin: TriboData Team at IAM-CMS at KIT, Karlsruhe, Germany
friendly name: Angular Velocity Setpoint Magnitude
persistent ID: TDO:0000373

AngularVelocityUnit
type: Class
subclass of: ConversionTargetUnit
subclass of: PhysicalQuantityUnit
comment: The unit that locks the meaning of the amount of the phenomenon of angular displacement per time.
definition origin: TriboData Team at IAM-CMS at KIT, Karlsruhe, Germany
friendly name: Angular Velocity Unit
persistent ID: TDO:0000106

AtmosphericPressureMagnitude
type: Class
subclass of: PhysicalQuantity
subclass of: Restriction
  on property: hasPhysicalUnit
  some values from: PressureUnit
subclass of: Restriction
  on property: hasRationalNumberValue
  some values from: float
comment: The physical quantity that characterizes the phenomenon called atmospheric pressure.
definition origin: TriboData Team at IAM-CMS at KIT, Karlsruhe, Germany
friendly name: Atmospheric Pressure Magnitude
persistent ID: TDO:0000361

Attribute
type: Class
subclass of: Abstract
comment: Qualities which we cannot or choose not to reify into subclasses of Object.
definition origin: SUMO Ontology (http://www.adampease.org/OP)

AvailableCuttingSpeedSetpoint
type: Class
subclass of: BandSawSpecification
subclass of: Restriction
  on property: hasQuantification
  some values from: AngularVelocitySetpointMagnitude
comment: The maximum permissable round tube diameter.
definition origin: TriboData Team at IAM-CMS at KIT, Karlsruhe, Germany
friendly name: Band Saw Cutting Speed
persistent ID: TDO:0000225

BandSaw
type: Class
subclass of: PoweredMachine
subclass of: Restriction
  on property: hasIdentifier
  some values from: EquipmentGeneralIdentifyingInformation
subclass of: Restriction
  on property: hasTechnicalSpecification
  some values from: BandSawSpecificationsArray
comment: Objects of this class pertain to the category of machines called band saw.
contextual type: LabEquipmentType
definition origin: TriboData Team at IAM-CMS at KIT, Karlsruhe, Germany
friendly name: Band Saw
persistent ID: TDO:0000517

BandSawAvailableCuttingSpeedSetpointsArray
type: Class
subclass of: BandSawRelatedCollective
subclass of: Restriction
  on property: isComprisedOf
  some values from: AvailableCuttingSpeedSetpoint
comment: Class containing information about the available cutting speed setpoints of a band saw object.
definition origin: TriboData Team at IAM-CMS at KIT, Karlsruhe, Germany
friendly name: List of Available Cutting Speed Setpoints
persistent ID: TDO:0000449

BandSawBladeDimensionsArray
type: Class
subclass of: BandSawRelatedCollective
subclass of: Restriction
  on property: isComprisedOf
  some values from: ObjectLength
subclass of: Restriction
  on property: isComprisedOf
  some values from: ObjectThickness
subclass of: Restriction
  on property: isComprisedOf
  some values from: ObjectWidth
comment: Class containing information about the technical specifications of a bandsaw blade.
definition origin: TriboData Team at IAM-CMS at KIT, Karlsruhe, Germany
friendly name: Blade Specifications
persistent ID: TDO:0000450

https://www.iam.kit.edu/cms/download/TriboDataFAIR_Ontology.owl#BandSawCuttingRangeAt45DegSpecificationsArray
type: Class
subclass of: BandSawRelatedCollective
subclass of: Restriction
  on property: isComprisedOf
  some values from: RectangularTubeMaximumHeight
subclass of: Restriction
  on property: isComprisedOf
  some values from: RectangularTubeMaximumWidth
subclass of: Restriction
  on property: isComprisedOf
  some values from: RoundTubeMaximumDiameter
subclass of: Restriction
  on property: isComprisedOf
  some values from: SquareTubeMaximumWidth
comment: Class containing information about the technical BandSaw's cutting range when cutting at 45 degrees.
definition origin: TriboData Team at IAM-CMS at KIT, Karlsruhe, Germany
friendly name: Cutting at 45 degress
persistent ID: TDO:0000451

https://www.iam.kit.edu/cms/download/TriboDataFAIR_Ontology.owl#BandSawCuttingRangeAt90DegSpecificationsArray
type: Class
subclass of: BandSawRelatedCollective
subclass of: Restriction
  on property: isComprisedOf
  some values from: RectangularTubeMaximumHeight
subclass of: Restriction
  on property: isComprisedOf
  some values from: RectangularTubeMaximumWidth
subclass of: Restriction
  on property: isComprisedOf
  some values from: RoundTubeMaximumDiameter
subclass of: Restriction
  on property: isComprisedOf
  some values from: SquareTubeMaximumWidth
comment: Class containing information about the technical BandSaw's cutting range when cutting at 90 degrees.
definition origin: TriboData Team at IAM-CMS at KIT, Karlsruhe, Germany
friendly name: Cutting at 90 degress
persistent ID: TDO:0000452

BandSawCuttingRangeSpecificationsArray
type: Class
subclass of: BandSawRelatedCollective
subclass of: Restriction
  on property: isComprisedOf
subclass of: Restriction
  on property: isComprisedOf
comment: Class containing information about the technical BandSaw's cutting ranges.
definition origin: TriboData Team at IAM-CMS at KIT, Karlsruhe, Germany
friendly name: Cutting Range
persistent ID: TDO:0000453

BandSawSpecificationsArray
type: Class
subclass of: BandSawRelatedCollective
subclass of: Restriction
  on property: isComprisedOf
  some values from: BandSawAvailableCuttingSpeedSetpointsArray
subclass of: Restriction
  on property: isComprisedOf
  some values from: BandSawBladeDimensionsArray
subclass of: Restriction
  on property: isComprisedOf
  some values from: ObjectMass
subclass of: Restriction
  on property: isComprisedOf
  some values from: PowerSupplyVoltage
subclass of: Restriction
  on property: isComprisedOf
  some values from: PowerSupplyWattage
subclass of: Restriction
  on property: isComprisedOf
  some values from: SpecimenClampingMethod
comment: Class containing information about the technical specifications of a bandsaw.
definition origin: TriboData Team at IAM-CMS at KIT, Karlsruhe, Germany
friendly name: Technical Specifications
persistent ID: TDO:0000454

BaseSpecimenClampingMethod
type: Class
subclass of: ClampingMethod
comment: Way of clamping of a physical object with the role of being a base body (specimen) in a tribometer.
definition origin: TriboData Team at IAM-CMS at KIT, Karlsruhe, Germany
friendly name: Base Body Clamping Method
persistent ID: TDO:0000185

BinFileTechnicalSpecificationsArray
type: Class
subclass of: DataFileRelatedCollective
subclass of: Restriction
  on property: isComprisedOf
  some values from: BinaryFileBytesBitsOrder
subclass of: Restriction
  on property: isComprisedOf
  some values from: BinaryFileOffsetAmount
subclass of: Restriction
  on property: isComprisedOf
  some values from: BinaryFileScalingFactor
subclass of: Restriction
  on property: isComprisedOf
  some values from: BinaryFileValuesToRead
subclass of: Restriction
  on property: isComprisedOf
  some values from: DatatypeClass
subclass of: Restriction
  on property: isComprisedOf
  some values from: NumberOfValueSetsInFile
comment: Instances of this class contain the information to open/access/read and interprete a *.bin file's contents adequately.
definition origin: TriboData Team at IAM-CMS at KIT, Karlsruhe, Germany
friendly name: *.bin File Technical Specifications
persistent ID: TDO:0000430

BinaryFileBytesBitsOrder
type: Class
subclass of: ClassificationCategory
comment: Instances of this class give the order for reading or writing bytes or bits in a file.
definition origin: TriboData Team at IAM-CMS at KIT, Karlsruhe, Germany
friendly name: Bytes or Bits Order
persistent ID: TDO:0000101

BinaryFileOffsetAmount
type: Class
subclass of: FileRelatedVariable
subclass of: Restriction
  on property: hasRationalNumberValue
  some values from: float
comment: Offset amount that has to be applied to all data in a file to get meaningful values.
definition origin: TriboData Team at IAM-CMS at KIT, Karlsruhe, Germany
friendly name: Binary File Offset Amount
persistent ID: TDO:0000336

BinaryFileScalingFactor
type: Class
subclass of: FileRelatedVariable
subclass of: Restriction
  on property: hasRationalNumberValue
  some values from: float
comment: Scaling factor that has to be applied to all data in a file to get meaningful values.
definition origin: TriboData Team at IAM-CMS at KIT, Karlsruhe, Germany
friendly name: Binary File Scaling Factor
persistent ID: TDO:0000337

BinaryFileValuesSize
type: Class
subclass of: Number
subclass of: Restriction
  on property: hasPhysicalUnit
  some values from: FileSizeUnit
subclass of: Restriction
  on property: hasRationalNumberValue
  some values from: integer
comment: Instances of this class quantify the size in bits of the values to read.
definition origin: TriboData Team at IAM-CMS at KIT, Karlsruhe, Germany
friendly name: Size of Values Magnitude
persistent ID: TDO:0000538

BinaryFileValuesToRead
type: Class
subclass of: FileRelatedVariable
subclass of: Restriction
  on property: isComprisedOf
  some values from: BinaryFileValuesSize
comment: Instances of this class indicate the size in bits of the values to read.
definition origin: TriboData Team at IAM-CMS at KIT, Karlsruhe, Germany
friendly name: Size of Values to Read
persistent ID: TDO:0000338

BlockSpecimen
type: Class
subclass of: ExperimentalObject
subclass of: Restriction
  on property: hasIdentifier
  some values from: SpecimenGeneralIdentifyingInformation
subclass of: Restriction
  on property: hasTechnicalSpecification
  some values from: BlockSpecimenMaterialInfoCollective
subclass of: Restriction
  on property: hasTechnicalSpecification
  some values from: BlockSpecimenSpatialInfoCollective
comment: Objects of this class contain a self-bound collection of mass bearing particles. Block specimens can have viscoelasticity.
contextual type: ExperimentalObjectType
definition origin: TriboData Team at IAM-CMS at KIT, Karlsruhe, Germany
friendly name: Block Specimen
persistent ID: TDO:0000513

BlockSpecimenDimensionsCollective
type: Class
subclass of: BlockSpecimentRelatedCollective
subclass of: Restriction
  on property: isComprisedOf
  some values from: ObjectDiameter
subclass of: Restriction
  on property: isComprisedOf
  some values from: ObjectHeight
subclass of: Restriction
  on property: isComprisedOf
  some values from: ObjectLength
subclass of: Restriction
  on property: isComprisedOf
  some values from: ObjectRadius
subclass of: Restriction
  on property: isComprisedOf
  some values from: ObjectWidth
comment: Class containing information about the spatial dimensions of a block specimen.
definition origin: TriboData Team at IAM-CMS at KIT, Karlsruhe, Germany
friendly name: Dimensions Information
persistent ID: TDO:0000455

BlockSpecimenFaceOrientationCollective
type: Class
subclass of: BlockSpecimentRelatedCollective
subclass of: Restriction
  on property: isComprisedOf
  some values from: BlockSpecimenOrientationIndicatingFeatureSide
subclass of: Restriction
  on property: isComprisedOf
  some values from: BlockSpecimenOrientationIndicatingFeatureType
comment: Class containing information about the spatial orientation of a specific face of a block specimen.
definition origin: TriboData Team at IAM-CMS at KIT, Karlsruhe, Germany
friendly name: Indicated Face Orientation
persistent ID: TDO:0000456

BlockSpecimenMaterialInfoCollective
type: Class
subclass of: BlockSpecimentRelatedCollective
subclass of: Restriction
  on property: isComprisedOf
  some values from: BlockSpecimenNominallyKnownMaterialInfoCollective
subclass of: Restriction
  on property: isComprisedOf
  some values from: MaterialCategory
subclass of: Restriction
  on property: isComprisedOf
  some values from: MaterialEmpiricalFormula
subclass of: Restriction
  on property: isComprisedOf
  some values from: MaterialName
comment: Class containing information about the material details of a block specimen.
definition origin: TriboData Team at IAM-CMS at KIT, Karlsruhe, Germany
friendly name: Material Information
persistent ID: TDO:0000457

BlockSpecimenNominallyKnownMaterialInfoCollective
type: Class
subclass of: BlockSpecimentRelatedCollective
subclass of: Restriction
  on property: isComprisedOf
  some values from: MaterialFerromagnetism
comment: Class containing information about the material details of a block specimen. These pieces of information are either reported (and assumed true) by the vendor, or are of general knowledge, but have not specifically been measured by a FAIR'ly described process.
definition origin: TriboData Team at IAM-CMS at KIT, Karlsruhe, Germany
friendly name: Nominally Known Material Information
persistent ID: TDO:0000458

BlockSpecimenOrientationCollective
type: Class
subclass of: BlockSpecimentRelatedCollective
subclass of: Restriction
  on property: isComprisedOf
  some values from: BlockSpecimenFaceOrientationCollective
subclass of: Restriction
  on property: isComprisedOf
  some values from: BlockSpecimenPrincipalTribologicalSide
comment: Class containing information about the spatial orientation of a block specimen.
definition origin: TriboData Team at IAM-CMS at KIT, Karlsruhe, Germany
friendly name: Face Orientation Information
persistent ID: TDO:0000459

BlockSpecimenOrientationIndicatingFeatureSide
type: Class
subclass of: PhysicalQuality
comment: The side on which indicating feature is. Defined by ISO (not US) technical drawing standards.
definition origin: TriboData Team at IAM-CMS at KIT, Karlsruhe, Germany
friendly name: Orientation Indicating Feature Side
persistent ID: TDO:0000179

BlockSpecimenOrientationIndicatingFeatureType
type: Class
subclass of: PhysicalQuality
comment: The type of orientation indicating feature.
definition origin: TriboData Team at IAM-CMS at KIT, Karlsruhe, Germany
friendly name: Orientation Indicating Feature Type
persistent ID: TDO:0000180

BlockSpecimenPrincipalTribologicalSide
type: Class
subclass of: PhysicalQuality
comment: The principal tribological side/s of interest. Defined by ISO (not US) technical drawing standards. Valid after a feature and its side have been defined.
definition origin: TriboData Team at IAM-CMS at KIT, Karlsruhe, Germany
friendly name: Tribological Interest Side/s
persistent ID: TDO:0000181

BlockSpecimenShape
type: Class
subclass of: PhysicalQuality
comment: The very basic shape of a block specimen.
definition origin: TriboData Team at IAM-CMS at KIT, Karlsruhe, Germany
friendly name: Shape
persistent ID: TDO:0000182

BlockSpecimenSpatialInfoCollective
type: Class
subclass of: BlockSpecimentRelatedCollective
subclass of: Restriction
  on property: isComprisedOf
  some values from: BlockSpecimenDimensionsCollective
subclass of: Restriction
  on property: isComprisedOf
  some values from: BlockSpecimenOrientationCollective
subclass of: Restriction
  on property: isComprisedOf
  some values from: BlockSpecimenShape
comment: Class containing information about the spatial (dimensions, position and arientation) details of a block specimen.
definition origin: TriboData Team at IAM-CMS at KIT, Karlsruhe, Germany
friendly name: Spatial Information
persistent ID: TDO:0000460

BlockSpecimenSpecificFaceOrientationCollective
type: Class
subclass of: BlockSpecimentRelatedCollective
subclass of: Restriction
  on property: isComprisedOf
  some values from: BlockSpecimenOrientationIndicatingFeatureSide
subclass of: Restriction
  on property: isComprisedOf
  some values from: BlockSpecimenOrientationIndicatingFeatureType
comment: Class containing information about the spatial orientation of the faces of a block sample.
definition origin: TriboData Team at IAM-CMS at KIT, Karlsruhe, Germany
friendly name: Indicated Face Orientation
persistent ID: TDO:0000461

BoschStandard
type: Class
subclass of: InterfacialMediumStandard
comment: Class containing information about the technical standard of the interfacial medium.
definition origin: TriboData Team at IAM-CMS at KIT, Karlsruhe, Germany
friendly name: Bosch Standard
persistent ID: TDO:0000216

Building
type: Class
subclass of: Location
comment: The "unique identifier" of the building within the specific institution.
definition origin: TriboData Team at IAM-CMS at KIT, Karlsruhe, Germany
friendly name: Building
persistent ID: TDO:0000527

CAVStandard
type: Class
subclass of: InterfacialMediumStandard
comment: Class containing information about the technical standard of the interfacial medium.
definition origin: TriboData Team at IAM-CMS at KIT, Karlsruhe, Germany
friendly name: CAV Standard
persistent ID: TDO:0000217

CameraViewType
type: Class
subclass of: ClassificationCategory
comment: Instances of this class specify the available camera views.
definition origin: TriboData Team at IAM-CMS at KIT, Karlsruhe, Germany
friendly name: Camera View Type
persistent ID: TDO:0000103

ClampingAreaDiameter
type: Class
subclass of: CupGrindingMachineSpecification
subclass of: Restriction
  on property: hasQuantification
  some values from: DistanceMagnitude
comment: The maximum permissable diameter of specimen to be held.
definition origin: TriboData Team at IAM-CMS at KIT, Karlsruhe, Germany
friendly name: Clamping Area Diameter
persistent ID: TDO:0000230

ClampingAreaLength
type: Class
subclass of: CupGrindingMachineSpecification
subclass of: Restriction
  on property: hasQuantification
  some values from: DistanceMagnitude
comment: The maximum permissable length of specimen to be held.
definition origin: TriboData Team at IAM-CMS at KIT, Karlsruhe, Germany
friendly name: Clamping Area Length
persistent ID: TDO:0000231

ClampingAreaWidth
type: Class
subclass of: CupGrindingMachineSpecification
subclass of: Restriction
  on property: hasQuantification
  some values from: DistanceMagnitude
comment: The maximum permissable width of specimen to be held. Shorter than Length dimension.
definition origin: TriboData Team at IAM-CMS at KIT, Karlsruhe, Germany
friendly name: Clamping Area Width
persistent ID: TDO:0000232

CleaningDurationSetpoint
type: Class
subclass of: Variable
subclass of: Restriction
  on property: hasQuantification
  some values from: TimeDuration
comment: The duration setting assigned to be maintained by the machine or user in a cleaning process.
definition origin: TriboData Team at IAM-CMS at KIT, Karlsruhe, Germany
friendly name: Cleaning Duration
persistent ID: TDO:0000224

CoarseVerticalTravelRange
type: Class
subclass of: CupGrindingMachineSpecification
subclass of: Restriction
  on property: hasQuantification
  some values from: DistanceMagnitude
comment: The travel range of the coarse/fast vertical drive of the machine's column (the distance inbetween lower limit and upper limit of the z-axis/vertical axis).
definition origin: TriboData Team at IAM-CMS at KIT, Karlsruhe, Germany
friendly name: Coarse Vertical Travel Range
persistent ID: TDO:0000233

Collection
type: Class
subclass of: PhysicalObject
comment: Collections have members like Classes, but, unlike Classes, they have a position in space-time and members can be added and subtracted without thereby changing the identity of the Collection. Some examples are toolkits, football teams, and flocks of sheep.
definition origin: SUMO Ontology (http://www.adampease.org/OP)

Comment
type: Class
subclass of: Proposition
subclass of: Restriction
  on property: hasText
  some values from: string
comment: Unconstrained statement by operator about a process or object.
definition origin: TriboData Team at IAM-CMS at KIT, Karlsruhe, Germany
friendly name: Comment
persistent ID: TDO:0000184

CommercialMachiningProcess
type: Class
subclass of: IndustrialProcess
subclass of: Restriction
  on property: hasIdentifier
  some values from: CommercialServiceGeneralIdentifyingInformation
subclass of: Restriction
  on property: physicallyModifies
  some values from: BlockSpecimen
subclass of: Restriction
  on property: physicallyResultsIn
  some values from: BlockSpecimen
comment: Class representing the physical process of machining a block of material for eventual use in scientific processes or equipment. The exact process is unknown, but it is performed by a firm that is external to the scientific institution.
contextual type: IndustrialProcedureType
definition origin: TriboData Team at IAM-CMS at KIT, Karlsruhe, Germany
friendly name: Commercial Machining
persistent ID: TDO:0000209

CommercialServiceGeneralIdentifyingInformation
type: Class
subclass of: IdentificatoryCollective
subclass of: Restriction
  on property: isComprisedOf
  some values from: EquipmentID
subclass of: Restriction
  on property: isComprisedOf
  some values from: EquipmentName
subclass of: Restriction
  on property: isComprisedOf
  some values from: LocationInformation
subclass of: Restriction
  on property: isComprisedOf
  some values from: ManufacturerName
subclass of: Restriction
  on property: isComprisedOf
  some values from: ObjectModelName
subclass of: Restriction
  on property: isComprisedOf
  some values from: OperatorPersonalInformation
subclass of: Restriction
  on property: isComprisedOf
  some values from: ParcelDeliveryReceiptTime
comment: Objects of this class contain information that describes known information about a process external to the research insitution.
definition origin: TriboData Team at IAM-CMS at KIT, Karlsruhe, Germany
friendly name: General Info
persistent ID: TDO:0000437

ConditionerAttributesArray
type: Class
subclass of: OpticalSurfaceProfilometerRelatedCollective
subclass of: TribometerRelatedCollective
subclass of: Restriction
  on property: isComprisedOf
  some values from: DAQPortName
subclass of: Restriction
  on property: isComprisedOf
  some values from: EquipmentID
subclass of: Restriction
  on property: isComprisedOf
  some values from: ManufacturerName
subclass of: Restriction
  on property: isComprisedOf
  some values from: ObjectModelName
comment: Class containing attributes about the installed sensors responsible for conditioning sensor outputs of a sensor.
definition origin: TriboData Team at IAM-CMS at KIT, Karlsruhe, Germany
friendly name: Connected Conditioner Info
persistent ID: TDO:0000495

ContentBearingObject
type: Class
subclass of: ContentBearingPhysical
comment: Any SelfConnectedObject that expresses content. This content may be a Proposition, e.g. when the ContentBearingObject is a Sentence or Text, or it may be a representation of an abstract or physical object, as with an Icon, a Word or a Phrase.
definition origin: SUMO Ontology (http://www.adampease.org/OP)

ContentBearingPhysical
type: Class
subclass of: Physical
comment: Any Object or Process that expresses content. This covers Objects that contain a Proposition, such as a book, as well as ManualSignLanguage, which may similarly contain a Proposition.
definition origin: SUMO Ontology (http://www.adampease.org/OP)

ConversionFactor
type: Class
subclass of: ExperimentalConversionVariable
subclass of: Restriction
  on property: hasQuantification
  some values from: ConversionFactorMagnitude
comment: Scaling factor that has to be applied to data. The conversion factor to convert V/mA raw-signal into something physically meaningful.
definition origin: TriboData Team at IAM-CMS at KIT, Karlsruhe, Germany
friendly name: Conversion Factor
persistent ID: TDO:0000285

ConversionFactorMagnitude
type: Class
subclass of: PhysicalQuantity
subclass of: Restriction
  on property: hasPhysicalUnit
  some values from: ConversionTargetUnit
subclass of: Restriction
  on property: hasRationalNumberValue
  some values from: float
comment: The physical quantity that characterizes the proportion by which a value is converted.
definition origin: TriboData Team at IAM-CMS at KIT, Karlsruhe, Germany
friendly name: Conversion Factor Magnitude
persistent ID: TDO:0000539

ConversionOffset
type: Class
subclass of: ExperimentalConversionVariable
subclass of: Restriction
  on property: hasQuantification
  some values from: ConversionOffsetMagnitude
comment: Scaling offset that has to be applied to data. The conversion offset to convert V/mA raw-signal into something physically meaningful.
definition origin: TriboData Team at IAM-CMS at KIT, Karlsruhe, Germany
friendly name: Conversion Offset
persistent ID: TDO:0000286

ConversionOffsetMagnitude
type: Class
subclass of: PhysicalQuantity
subclass of: Restriction
  on property: hasPhysicalUnit
  some values from: ConversionTargetUnit
subclass of: Restriction
  on property: hasRationalNumberValue
  some values from: float
comment: The physical quantity that characterizes the offset by which a value is converted.
definition origin: TriboData Team at IAM-CMS at KIT, Karlsruhe, Germany
friendly name: Conversion Offset Magnitude
persistent ID: TDO:0000540

ConversionTargetUnit
type: Class
subclass of: ClassificationCategory
comment: Instances of this class lock the meaning of a magnitude. Their purpose is to indicate the conversion target.
definition origin: TriboData Team at IAM-CMS at KIT, Karlsruhe, Germany
friendly name: Target Unit of Conversion
persistent ID: TDO:0000104

ConversionUnit
type: Class
subclass of: ConversionTargetUnit
subclass of: PhysicalQuantityUnit
comment: The unit that locks the meaning of the amount of a conversion.
definition origin: TriboData Team at IAM-CMS at KIT, Karlsruhe, Germany
friendly name: Conversion Unit
persistent ID: TDO:0000541

Coolant
type: Class
subclass of: FunctionalFluid
comment: Coolants are used most often in industrial processes. Important: this is the object in term of its function/role/application, and not its particular chemical composition (that would be instead an abstract representation of the internal structure).
definition origin: TriboData Team at IAM-CMS at KIT, Karlsruhe, Germany
friendly name: Coolant
persistent ID: TDO:0000515

CoolingMediumFlowRateSetpoint
type: Class
subclass of: CupGrindingProcessSetting
subclass of: Restriction
  on property: hasQuantification
  some values from: FlowRateFractionMagnitude
comment: Instances of this class characterize the prescribed coolant flow rate.
definition origin: TriboData Team at IAM-CMS at KIT, Karlsruhe, Germany
friendly name: Cooling Medium Flow Rate
persistent ID: TDO:0000290

CounterSpecimenClampingMethod
type: Class
subclass of: ClampingMethod
comment: Way of clamping of a physical object with the role of being a counter body (specimen) in a tribometer.
definition origin: TriboData Team at IAM-CMS at KIT, Karlsruhe, Germany
friendly name: Counter Body Clamping Method
persistent ID: TDO:0000186

CsvFileTechnicalSpecificationsArray
type: Class
subclass of: DataFileRelatedCollective
subclass of: Restriction
  on property: isComprisedOf
  some values from: DecimalSeparator
subclass of: Restriction
  on property: isComprisedOf
  some values from: Delimiter
comment: Instances of this class contain the information to open/access/read and interprete a *.csv file's contents adequately.
definition origin: TriboData Team at IAM-CMS at KIT, Karlsruhe, Germany
friendly name: *.csv File Technical Specifications
persistent ID: TDO:0000431

CupGrindingGoal
type: Class
subclass of: ClassificationCategory
comment: Instances of this class specify the classification goal of cup grinding step.
definition origin: TriboData Team at IAM-CMS at KIT, Karlsruhe, Germany
friendly name: Cup Grinding Goal
persistent ID: TDO:0000126

CupGrindingInfeedInfoArray
type: Class
subclass of: CupGrindingProcessArray
subclass of: Restriction
  on property: isComprisedOf
  some values from: InfeedMode
subclass of: Restriction
  on property: isComprisedOf
  some values from: SparkOutRotarySpeedSetpoint
subclass of: Restriction
  on property: isComprisedOf
  some values from: SparkOutTableRotationsSetpoint
subclass of: Restriction
  on property: isComprisedOf
  some values from: SparkOutTimeSetpoint
subclass of: Restriction
  on property: isComprisedOf
  some values from: VerticalEndPosition
subclass of: Restriction
  on property: isComprisedOf
  some values from: VerticalInfeedTableRotationsIntervalSetpoint
subclass of: Restriction
  on property: isComprisedOf
  some values from: VerticalInfeedTimeIntervalSetpoint
subclass of: Restriction
  on property: isComprisedOf
  some values from: VerticalStartingPosition
subclass of: Restriction
  on property: isComprisedOf
  some values from: VerticalStepSizeSetpoint
comment: Class containing information that gives information on the infeed parameters in this grinding step.
definition origin: TriboData Team at IAM-CMS at KIT, Karlsruhe, Germany
friendly name: Infeed Info
persistent ID: TDO:0000394

CupGrindingMachine
type: Class
subclass of: PoweredMachine
subclass of: Restriction
  on property: hasIdentifier
  some values from: EquipmentGeneralIdentifyingInformation
subclass of: Restriction
  on property: hasTechnicalSpecification
  some values from: CupGrindingMachineSpecificationsArray
comment: Objects of this class pertain to the category of machines called cup grinding machine.
contextual type: LabEquipmentType
definition origin: TriboData Team at IAM-CMS at KIT, Karlsruhe, Germany
friendly name: Cup Grinding Machine
persistent ID: TDO:0000518

CupGrindingMachineSpecificationsArray
type: Class
subclass of: CupGrindingMachineRelatedCollective
subclass of: Restriction
  on property: isComprisedOf
  some values from: CoarseVerticalTravelRange
subclass of: Restriction
  on property: isComprisedOf
  some values from: CupGrindingMachineSpecimenMountingSpecificationsArray
subclass of: Restriction
  on property: isComprisedOf
  some values from: FineVerticalTravelRange
subclass of: Restriction
  on property: isComprisedOf
  some values from: FineVerticalTravelResolution
subclass of: Restriction
  on property: isComprisedOf
  some values from: GrindingToolType
subclass of: Restriction
  on property: isComprisedOf
  some values from: MaximumSpecimenHeightWithCeramicCup
subclass of: Restriction
  on property: isComprisedOf
  some values from: MaximumSpecimenHeightWithDiamondCup
subclass of: Restriction
  on property: isComprisedOf
  some values from: MaximumToolTurningSpeedSetpoint
subclass of: Restriction
  on property: isComprisedOf
  some values from: MinimumToolTurningSpeedSetpoint
subclass of: Restriction
  on property: isComprisedOf
  some values from: WetGrindingAbility
comment: Class containing information about the technical specifications of a cup grinding machine.
definition origin: TriboData Team at IAM-CMS at KIT, Karlsruhe, Germany
friendly name: Technical Specifications
persistent ID: TDO:0000462

CupGrindingMachineSpecimenMountingSpecificationsArray
type: Class
subclass of: CupGrindingMachineRelatedCollective
subclass of: Restriction
  on property: isComprisedOf
  some values from: ClampingAreaDiameter
subclass of: Restriction
  on property: isComprisedOf
  some values from: ClampingAreaLength
subclass of: Restriction
  on property: isComprisedOf
  some values from: ClampingAreaWidth
subclass of: Restriction
  on property: isComprisedOf
  some values from: MaximumTurningSpeedSetpoint
subclass of: Restriction
  on property: isComprisedOf
  some values from: MinimumTurningSpeedSetpoint
subclass of: Restriction
  on property: isComprisedOf
  some values from: SpecimenClampingMethod
subclass of: Restriction
  on property: isComprisedOf
  some values from: TurningDirectionSetpoint
comment: Class containing information about the specimen mounting in a cup grinding machine.
definition origin: TriboData Team at IAM-CMS at KIT, Karlsruhe, Germany
friendly name: Specimen Mounting Specifications
persistent ID: TDO:0000463

CupGrindingProcess
type: Class
subclass of: IndustrialProcess
subclass of: Restriction
  on property: employsEquipment
  some values from: CupGrindingMachine
subclass of: Restriction
  on property: hasIdentifier
  some values from: ProcessGeneralIdentifyingInformation
subclass of: Restriction
  on property: isComprisedOf
  some values from: CupGrindingStepsArray
subclass of: Restriction
  on property: isControlledBy
  some values from: UncontrolledEnvironmentalConditionsArray
subclass of: Restriction
  on property: physicallyModifies
  some values from: BlockSpecimen
comment: Class representing the physical process of cup grinding of a specimen with the aim of changing its surface characteristics. It ends with demounting of the sample/workpiece from the mounting table.
contextual type: IndustrialProcedureType
definition origin: TriboData Team at IAM-CMS at KIT, Karlsruhe, Germany
friendly name: Cup Grinding
persistent ID: TDO:0000210

CupGrindingSpecimenPositioningInfoArray
type: Class
subclass of: CupGrindingProcessArray
subclass of: Restriction
  on property: isComprisedOf
  some values from: MaximumPositioningSystemTurningSpeedSetpoint
subclass of: Restriction
  on property: isComprisedOf
  some values from: MinimumPositioningSystemTurningSpeedSetpoint
subclass of: Restriction
  on property: isComprisedOf
  some values from: PositioningSystemTurningSpeedSetpoint
comment: Class containing information that characterizes the block specimen positioning. This has a major influence on the resulting roughness of the sample's surfaces.
definition origin: TriboData Team at IAM-CMS at KIT, Karlsruhe, Germany
friendly name: Specimen Positioning Info
persistent ID: TDO:0000395

CupGrindingStepsArray
type: Class
subclass of: CupGrindingProcessArray
subclass of: Restriction
  on property: isComprisedOf
  some values from: CupGrindingVariableInputArrayItem
comment: Class containing the ordered list of sequential steps, in terms of parameters, specific to the process.
definition origin: TriboData Team at IAM-CMS at KIT, Karlsruhe, Germany
friendly name: Cup Grinding Steps Array
persistent ID: TDO:0000396

CupGrindingSummaryArray
type: Class
subclass of: CupGrindingProcessArray
subclass of: Restriction
  on property: isComprisedOf
  some values from: Comment
subclass of: Restriction
  on property: isComprisedOf
  some values from: CupGrindingGoal
comment: Class containing derived information about the process. All derived information stems from the information recorded in other locations of the record.
definition origin: TriboData Team at IAM-CMS at KIT, Karlsruhe, Germany
friendly name: Process Summary
persistent ID: TDO:0000397

CupGrindingToolID
type: Class
subclass of: EquipmentRelatedName
comment: Instances of this class specify the model of cup grinding tool.
definition origin: TriboData Team at IAM-CMS at KIT, Karlsruhe, Germany
friendly name: Cup Grinding Tool ID
persistent ID: TDO:0000148

CupGrindingToolInfoArray
type: Class
subclass of: CupGrindingProcessArray
subclass of: Restriction
  on property: isComprisedOf
  some values from: AbrasiveMaterialType
subclass of: Restriction
  on property: isComprisedOf
  some values from: CupGrindingToolID
subclass of: Restriction
  on property: isComprisedOf
  some values from: CupGrindingToolType
subclass of: Restriction
  on property: isComprisedOf
  some values from: ManufacturerName
subclass of: Restriction
  on property: isComprisedOf
  some values from: ObjectGritSize
subclass of: Restriction
  on property: isComprisedOf
  some values from: TurningFrequencySetpoint
comment: Class containing information that characterizes the grinding tool.
definition origin: TriboData Team at IAM-CMS at KIT, Karlsruhe, Germany
friendly name: Cup Grinding Tool Info
persistent ID: TDO:0000398

CupGrindingToolType
type: Class
subclass of: ClassificationCategory
comment: Instances of this class specify the classification type of cup grinding tool.
definition origin: TriboData Team at IAM-CMS at KIT, Karlsruhe, Germany
friendly name: Cup Grinding Tool Type
persistent ID: TDO:0000127

CupGrindingVariableInputArrayItem
type: Class
subclass of: CupGrindingProcessArray
subclass of: Restriction
  on property: hasSummary
  some values from: CupGrindingSummaryArray
subclass of: Restriction
  on property: isComprisedOf
  some values from: Coolant
subclass of: Restriction
  on property: isComprisedOf
  some values from: CoolingMediumFlowRateSetpoint
subclass of: Restriction
  on property: isComprisedOf
  some values from: CupGrindingInfeedInfoArray
subclass of: Restriction
  on property: isComprisedOf
  some values from: CupGrindingSpecimenPositioningInfoArray
subclass of: Restriction
  on property: isComprisedOf
  some values from: CupGrindingToolInfoArray
subclass of: Restriction
  on property: isComprisedOf
  some values from: SequentialOrderPosition
subclass of: Restriction
  on property: isComprisedOf
  some values from: ToolCleaningAccessoryType
subclass of: Restriction
  on property: isComprisedOf
  some values from: ToolCleaningTimeIntervalType
comment: Class containing a bundle of parameters needed for a cup grinding process.
definition origin: TriboData Team at IAM-CMS at KIT, Karlsruhe, Germany
friendly name: List Item (Cup Grinding Step)
persistent ID: TDO:0000399

CuttingPressureSetpoint
type: Class
subclass of: SawingProcessSetting
subclass of: Restriction
  on property: hasQuantification
  some values from: PressureSetpointMagnitude
comment: The setting assigned to be maintained by the machine.
definition origin: TriboData Team at IAM-CMS at KIT, Karlsruhe, Germany
friendly name: Cutting Pressure Setpoint
persistent ID: TDO:0000309

CuttingSpeedSetpoint
type: Class
subclass of: SawingProcessSetting
subclass of: Restriction
  on property: hasQuantification
  some values from: SpeedSetpointMagnitude
comment: The setting assigned to be maintained by the machine.
definition origin: TriboData Team at IAM-CMS at KIT, Karlsruhe, Germany
friendly name: Cutting Speed Setpoint
persistent ID: TDO:0000310

DAQInterfaceName
type: Class
subclass of: EquipmentRelatedName
comment: Field that specifies the interface that is used to connect the DAQ device to the recording PC.
definition origin: TriboData Team at IAM-CMS at KIT, Karlsruhe, Germany
friendly name: DAQ Interface Name
persistent ID: TDO:0000149

DAQPortName
type: Class
subclass of: EquipmentRelatedName
comment: The port which collects/outputs signal to a DAQ device.
definition origin: TriboData Team at IAM-CMS at KIT, Karlsruhe, Germany
friendly name: DAQ Connection Port
persistent ID: TDO:0000150

DAQTerminalConfiguration
type: Class
subclass of: ClassificationCategory
comment: Instances of this class give the configuration for reading or writing at a terminal.
definition origin: TriboData Team at IAM-CMS at KIT, Karlsruhe, Germany
friendly name: Terminal Configuration
persistent ID: TDO:0000128

DarkCorrectionPerformance
type: Class
subclass of: MeasuringMethod
subclass of: Restriction
  on property: hasBoolean
  some values from: boolean
comment: Instances of this class indicate whether the sensor's dark correction functions prior to the measurement was performed.
definition origin: TriboData Team at IAM-CMS at KIT, Karlsruhe, Germany
friendly name: Dark Correction Performed
persistent ID: TDO:0000202

DataProcessing
type: Class
subclass of: ComputerProcess
subclass of: Restriction
  on property: generatesFile
  some values from: File
subclass of: Restriction
  on property: hasIdentifier
  some values from: ProcessGeneralIdentifyingInformation
subclass of: Restriction
  on property: isComprisedOf
  some values from: SoftwareUsedArray
subclass of: Restriction
  on property: takesDataFromProcess
  some values from: TribologicalExperiment
comment: Class representing the execution of a particular computer code which extracts/reshapes/processes data from one form to another.
contextual type: DataProcessingType
definition origin: TriboData Team at IAM-CMS at KIT, Karlsruhe, Germany
friendly name: Data Processing
persistent ID: TDO:0000207

DatatypeClass
type: Class
subclass of: ClassificationCategory
comment: Instances of this class give the class of values to read in a file.
definition origin: TriboData Team at IAM-CMS at KIT, Karlsruhe, Germany
friendly name: Datatype Class
persistent ID: TDO:0000129

DeadWeightSetpoint
type: Class
subclass of: TribologicalExperimentSetting
subclass of: Restriction
  on property: hasQuantification
  some values from: MassSetpointMagnitude
comment: The weight applied by the weighing object placed to supply normal load.
definition origin: TriboData Team at IAM-CMS at KIT, Karlsruhe, Germany
friendly name: Actual Applied Deadweight Setpoint
persistent ID: TDO:0000323

DecimalSeparator
type: Class
subclass of: Character
comment: Instances of this class specify the decimal separator used in a file.
definition origin: TriboData Team at IAM-CMS at KIT, Karlsruhe, Germany
friendly name: Decimal Separator
persistent ID: TDO:0000511

Delimiter
type: Class
subclass of: Character
comment: Instances of this class specify the delimiter used in a file.
definition origin: TriboData Team at IAM-CMS at KIT, Karlsruhe, Germany
friendly name: Delimiter
persistent ID: TDO:0000512

DemagnetizationProcess
type: Class
subclass of: IndustrialProcess
subclass of: Restriction
  on property: employsEquipment
  some values from: DemagnetizingPlate
subclass of: Restriction
  on property: hasIdentifier
  some values from: ProcessGeneralIdentifyingInformation
subclass of: Restriction
  on property: isControlledBy
  some values from: DemagnetizationProcessInputsArray
subclass of: Restriction
  on property: isControlledBy
  some values from: UncontrolledEnvironmentalConditionsArray
subclass of: Restriction
  on property: physicallyModifies
  some values from: BlockSpecimen
comment: Class representing the monitored processes that produce a (set of) file(s) whose contents could be used for 1D visualization.
contextual type: IndustrialProcedureType
definition origin: TriboData Team at IAM-CMS at KIT, Karlsruhe, Germany
friendly name: Demagnetization
persistent ID: TDO:0000211

DemagnetizationProcessInputsArray
type: Class
subclass of: CircumstancesCollective
subclass of: Restriction
  on property: isControlledBy
  some values from: DemagnetizingMotionDIrection
subclass of: Restriction
  on property: isControlledBy
  some values from: DistanceBetweenPlateAndSpecimen
subclass of: Restriction
  on property: isControlledBy
  some values from: EndingDistanceFromPlate
subclass of: Restriction
  on property: isControlledBy
  some values from: MotionSpeedSetpoint
subclass of: Restriction
  on property: isControlledBy
  some values from: NumberOfProcedureRepeats
subclass of: Restriction
  on property: isControlledBy
  some values from: StartingDistanceFromPlate
comment: Class containing information about the parameters that are put into the involved scientific equipment to run it optimally.
definition origin: TriboData Team at IAM-CMS at KIT, Karlsruhe, Germany
friendly name: System/Setup Inputs
persistent ID: TDO:0000400

DemagnetizingMotionDIrection
type: Class
subclass of: DemagnetizationProcessSetting
comment: Instances of this class characterize the direction of motion during the time the demagnetizing field is affecting the workpiece/specimen.
definition origin: TriboData Team at IAM-CMS at KIT, Karlsruhe, Germany
friendly name: Motion Direction
persistent ID: TDO:0000302

DemagnetizingPlate
type: Class
subclass of: PoweredMachine
subclass of: Restriction
  on property: hasIdentifier
  some values from: EquipmentGeneralIdentifyingInformation
subclass of: Restriction
  on property: hasTechnicalSpecification
  some values from: DemagnitizingPlateSpecificationsArray
comment: Objects of this class pertain to the category of machines called demagnetizing plate.
contextual type: LabEquipmentType
definition origin: TriboData Team at IAM-CMS at KIT, Karlsruhe, Germany
friendly name: Demagnetizing Plate
persistent ID: TDO:0000519

DemagnetizingPlateDutyCycle
type: Class
subclass of: DemagnetizingPlateSpecification
subclass of: Restriction
  on property: hasQuantification
  some values from: DutyCycleFractionMagnitude
comment: Instances of this class characterize the duty cycle of the plate. The duty cycle provides information on how long a demagnetizing system may run. It is typically given as a relative ratio of on-time/total time in percent. A value of 100% indicates the tool can be operated continuously without need for cooldown pauses.
definition origin: TriboData Team at IAM-CMS at KIT, Karlsruhe, Germany
friendly name: Duty Cycle
persistent ID: TDO:0000243

DemagnitizingPlateSpecificationsArray
type: Class
subclass of: SpecificationsCollective
subclass of: Restriction
  on property: isComprisedOf
  some values from: DemagnetizingPlateDutyCycle
subclass of: Restriction
  on property: isComprisedOf
  some values from: IPClass
subclass of: Restriction
  on property: isComprisedOf
  some values from: MagneticFieldEmissionClassification
subclass of: Restriction
  on property: isComprisedOf
  some values from: MagneticFieldEmissionClassificationStandard
subclass of: Restriction
  on property: isComprisedOf
  some values from: MaximumSpecimenThickness
subclass of: Restriction
  on property: isComprisedOf
  some values from: PoleSurfaceLength
subclass of: Restriction
  on property: isComprisedOf
  some values from: PoleSurfaceWidth
subclass of: Restriction
  on property: isComprisedOf
  some values from: PowerConsumption
subclass of: Restriction
  on property: isComprisedOf
  some values from: PowerSupplyVoltage
subclass of: Restriction
  on property: isComprisedOf
  some values from: WorkingAreaLength
subclass of: Restriction
  on property: isComprisedOf
  some values from: WorkingAreaWidth
comment: Class containing information about the technical specifications of a demagnetizing plate.
definition origin: TriboData Team at IAM-CMS at KIT, Karlsruhe, Germany
friendly name: Technical Specifications
persistent ID: TDO:0000464

DiscHeightFluctuationSetpoint
type: Class
subclass of: TribologicalExperimentSetting
subclass of: Restriction
  on property: hasQuantification
  some values from: DistanceSetpointMagnitude
comment: For unidrectional tribological experiments using a disc as basebody, this meta-information describes the maximum cyclic fluctuation in the disk's height with respect with the counterbody, before the experiment begins.
definition origin: TriboData Team at IAM-CMS at KIT, Karlsruhe, Germany
friendly name: Height Fluctuation Range
persistent ID: TDO:0000324

DistanceBetweenPlateAndSpecimen
type: Class
subclass of: DemagnetizationProcessSetting
subclass of: Restriction
  on property: hasQuantification
  some values from: DistanceMagnitude
comment: Instances of this class give information about the distance between the workpiece/sample and the demagnetizing plate. Often an estimate is good enough for this value.
definition origin: TriboData Team at IAM-CMS at KIT, Karlsruhe, Germany
friendly name: Distance Between Sample and Plate
persistent ID: TDO:0000303

DistanceMagnitude
type: Class
subclass of: PhysicalQuantity
subclass of: Restriction
  on property: hasPhysicalUnit
  some values from: DistanceUnit
subclass of: Restriction
  on property: hasRationalNumberValue
  some values from: float
comment: The physical quantity that characterizes the quantity called distance.
definition origin: TriboData Team at IAM-CMS at KIT, Karlsruhe, Germany
friendly name: Distance Magnitude
persistent ID: TDO:0000362

DistanceSetpointMagnitude
type: Class
subclass of: SetpointQuantity
subclass of: Restriction
  on property: hasPhysicalUnit
  some values from: DistanceUnit
subclass of: Restriction
  on property: hasRationalNumberValue
  some values from: float
comment: The physical quantity that characterizes the quantity called distance.
definition origin: TriboData Team at IAM-CMS at KIT, Karlsruhe, Germany
friendly name: Distance Magnitude
persistent ID: TDO:0000374

DistanceUnit
type: Class
subclass of: ConversionTargetUnit
subclass of: PhysicalQuantityUnit
comment: Called Distance, not confuse with Length, which is the longest dimension of an object.
comment: The unit that locks the meaning of the magnitude of physical length.
definition origin: TriboData Team at IAM-CMS at KIT, Karlsruhe, Germany
friendly name: Distance Unit
persistent ID: TDO:0000107

DurationToTemperature
type: Class
subclass of: FurnaceSpecification
subclass of: HeatTreatmentProcessSeeting
subclass of: Restriction
  on property: hasQuantification
  some values from: TimeDuration
comment: The equipment setting which specifies the temperature setting of a machine.
definition origin: TriboData Team at IAM-CMS at KIT, Karlsruhe, Germany
friendly name: Time Duration
persistent ID: TDO:0000537

DutyCycleFractionMagnitude
type: Class
subclass of: PhysicalQuantity
subclass of: Restriction
  on property: hasPhysicalUnit
  some values from: FractionUnit
subclass of: Restriction
  on property: hasRationalNumberValue
  some values from: float
comment: The physical quantity that characterizes the phenomenon called duty cycle as a fraction of what is possible.
definition origin: TriboData Team at IAM-CMS at KIT, Karlsruhe, Germany
friendly name: Duty Cycle Fraction Magnitude
persistent ID: TDO:0000363

EndingDistanceFromPlate
type: Class
subclass of: DemagnetizationProcessSetting
subclass of: Restriction
  on property: hasQuantification
  some values from: DistanceMagnitude
comment: Instances of this class give information about the distance between sample and trailing edge of the demagnetizing plate after finishing the respective demagnetizing motion.
definition origin: TriboData Team at IAM-CMS at KIT, Karlsruhe, Germany
friendly name: Motion End Distance in Front of Demagnetizing Plate
persistent ID: TDO:0000304

Entity
type: Class
comment: The universal class of individuals. This is the root node of the ontology.
definition origin: SUMO Ontology (http://www.adampease.org/OP)

EquipmentDistanceResolution
type: Class
subclass of: EquipmentSpecification
subclass of: Restriction
  on property: hasQuantification
  some values from: DistanceMagnitude
comment: Equipment Distance/Displacement Resolution
definition origin: TriboData Team at IAM-CMS at KIT, Karlsruhe, Germany
friendly name: Equipment Resolution
persistent ID: TDO:0000247

EquipmentGeneralIdentifyingInformation
type: Class
subclass of: IdentificatoryCollective
subclass of: Restriction
  on property: isComprisedOf
  some values from: EquipmentID
subclass of: Restriction
  on property: isComprisedOf
  some values from: EquipmentName
subclass of: Restriction
  on property: isComprisedOf
  some values from: LocationInformation
subclass of: Restriction
  on property: isComprisedOf
  some values from: ManufacturerName
subclass of: Restriction
  on property: isComprisedOf
  some values from: ObjectModelName
subclass of: Restriction
  on property: isComprisedOf
  some values from: OperatorPersonalInformation
comment: Objects of this class contain information that unequivocally identifies a piece of equipment.
definition origin: TriboData Team at IAM-CMS at KIT, Karlsruhe, Germany
friendly name: General Info
persistent ID: TDO:0000438

EquipmentID
type: Class
subclass of: EquipmentRelatedName
subclass of: Restriction
  on property: hasText
  some values from: string
comment: The unique alphanumeric ID of the machine. Could be the serial number or any other assigned unique ID.
definition origin: TriboData Team at IAM-CMS at KIT, Karlsruhe, Germany
friendly name: Equipment ID
persistent ID: TDO:0000151

EquipmentName
type: Class
subclass of: EquipmentRelatedName
subclass of: Restriction
  on property: hasText
  some values from: string
comment: The type of machine and the way it is referred to. The friendly way to identify it.
definition origin: TriboData Team at IAM-CMS at KIT, Karlsruhe, Germany
friendly name: Equipment/Product Model
persistent ID: TDO:0000152

EquipmentNonSpecificIdentificatoryName
type: Class
subclass of: EquipmentRelatedName
comment: The type of machine and the way it is referred to. The friendly way to identify it.
definition origin: TriboData Team at IAM-CMS at KIT, Karlsruhe, Germany
friendly name: Equipment Type/Name
persistent ID: TDO:0000153

EquipmentRole
type: Class
subclass of: Role
comment: Class containing the periphery's role/s in a tribometer.
definition origin: TriboData Team at IAM-CMS at KIT, Karlsruhe, Germany
friendly name: Equipment Role
persistent ID: TDO:0000391

ExperimentElapsedTime
type: Class
subclass of: ExperimentalOutput
subclass of: Restriction
  on property: hasQuantification
  some values from: TimeDuration
comment: Instances of this class represent the total elapsed time of an experiment.
definition origin: TriboData Team at IAM-CMS at KIT, Karlsruhe, Germany
friendly name: Total Elapsed Time
persistent ID: TDO:0000287

ExperimentOutputFileMetadata
type: Class
subclass of: MetadataCollective
subclass of: Restriction
  on property: isComprisedOf
  some values from: FileName
subclass of: Restriction
  on property: isComprisedOf
  some values from: FilePath
subclass of: Restriction
  on property: isComprisedOf
  some values from: FilePurpose
subclass of: Restriction
  on property: isComprisedOf
  some values from: FileSize
subclass of: Restriction
  on property: isComprisedOf
  some values from: FileTechnicalSpecificationsArray
subclass of: Restriction
  on property: isComprisedOf
  some values from: NumberOfFiles
subclass of: Restriction
  on property: isComprisedOf
  some values from: TimeSeriesContentSpecificationsArray
subclass of: Restriction
  on property: isControlledBy
  some values from: FilePersistentID
comment: Instances of this class contain the metadata associated with an output file or a series of files with the same metadata.
definition origin: TriboData Team at IAM-CMS at KIT, Karlsruhe, Germany
friendly name: List Item (Produced File Metadata)
persistent ID: TDO:0000444

ExperimentOutputFileMetadataArray
type: Class
subclass of: DataFileRelatedCollective
subclass of: Restriction
  on property: isComprisedOf
  some values from: ExperimentOutputFileMetadata
comment: Instances of this class contain a collection of metadata records each associated with a file or a series of files sharing the same metadata. Note that this is only used for files produced by the experiment (i.e. output files), not files serving as input (e.g. configuration files).
definition origin: TriboData Team at IAM-CMS at KIT, Karlsruhe, Germany
friendly name: Array Produced File Metadata
persistent ID: TDO:0000432

ExperimentTraveledDistance
type: Class
subclass of: ExperimentalOutput
subclass of: Restriction
  on property: hasQuantification
  some values from: DistanceMagnitude
comment: Information about the "distance equivalent" that an experimental contact has been exposed to by the end of an experiment.
definition origin: TriboData Team at IAM-CMS at KIT, Karlsruhe, Germany
friendly name: Traveled Distance
persistent ID: TDO:0000288

File
type: Class
subclass of: ContentBearingObject
subclass of: Restriction
  on property: hasIdentifier
  some values from: FileName
comment: Instances of this class contain information structures as computer code.
definition origin: TriboData Team at IAM-CMS at KIT, Karlsruhe, Germany
friendly name: File
persistent ID: TDO:0000393

FileCreatedTime
type: Class
subclass of: TimePoint
subclass of: Restriction
  on property: hasTimeStamp
  qualified cardinality: 1
  on data range: dateTimeStamp
comment: Instances of this class contain information about a digital object's time of creation.
definition origin: TriboData Team at IAM-CMS at KIT, Karlsruhe, Germany
friendly name: Created at
persistent ID: TDO:0000384

FileModifiedTime
type: Class
subclass of: TimePoint
subclass of: Restriction
  on property: hasTimeStamp
  qualified cardinality: 1
  on data range: dateTimeStamp
comment: Instances of this class contain information about a digital object's time of modification.
definition origin: TriboData Team at IAM-CMS at KIT, Karlsruhe, Germany
friendly name: Last Modified at
persistent ID: TDO:0000385

FileName
type: Class
subclass of: Name
subclass of: Restriction
  on property: hasText
  some values from: string
comment: Name of data file (e.g. "Testrun_001.bin"). If multiple files of the same type exist and the names of those files only differ in a numbering suffix (e.g. Testrun_001.bin through Testrun_999.bin), each digit of the numbering suffix is replaced by "n". For the present example, "Testrun_001.bin" would be named "Testrun_nnn.bin". "nnn" is then contained in NumberOfFiles class instance.
definition origin: TriboData Team at IAM-CMS at KIT, Karlsruhe, Germany
friendly name: File Name
persistent ID: TDO:0000163

FilePath
type: Class
subclass of: Address
subclass of: Restriction
  on property: hasText
  some values from: string
comment: Filepath to the locally stored original measurement file on the computer connected to a measuring machine. More instances of this class could be added if the files are moved/copied to other locations.
definition origin: TriboData Team at IAM-CMS at KIT, Karlsruhe, Germany
friendly name: File Path
persistent ID: TDO:0000100

FilePersistentID
type: Class
subclass of: Name
subclass of: Restriction
  on property: hasText
  some values from: string
comment: Unique ID generated for every uploaded file to an electronic lab notebook.
definition origin: TriboData Team at IAM-CMS at KIT, Karlsruhe, Germany
friendly name: File Persistent ID
persistent ID: TDO:0000164

FilePurpose
type: Class
subclass of: Role
comment: Instances of this class specify the purpose of generation of a specific output file during conduction of the experiment. Free text allowed.
definition origin: TriboData Team at IAM-CMS at KIT, Karlsruhe, Germany
friendly name: File/s Purpose
persistent ID: TDO:0000392

FileSize
type: Class
subclass of: FileRelatedVariable
subclass of: Restriction
  on property: hasQuantification
  some values from: FileSizeMagnitude
comment: Instances of this class quantify a file size.
definition origin: TriboData Team at IAM-CMS at KIT, Karlsruhe, Germany
friendly name: File Size
persistent ID: TDO:0000339

FileSizeMagnitude
type: Class
subclass of: PhysicalQuantity
subclass of: Restriction
  on property: hasPhysicalUnit
  some values from: FileSizeUnit
subclass of: Restriction
  on property: hasRationalNumberValue
  some values from: float
comment: The physical quantity that characterizes the quantity called file size.
definition origin: TriboData Team at IAM-CMS at KIT, Karlsruhe, Germany
friendly name: File Size Magnitude
persistent ID: TDO:0000364

FileSizeUnit
type: Class
subclass of: ConversionTargetUnit
subclass of: PhysicalQuantityUnit
comment: The unit that locks the meaning of the magnitude of computer storage size magnitude.
definition origin: TriboData Team at IAM-CMS at KIT, Karlsruhe, Germany
friendly name: File Size Unit
persistent ID: TDO:0000108

FileTechnicalSpecificationsArray
type: Class
subclass of: DataFileRelatedCollective
subclass of: Restriction
  on property: isComprisedOf
  some values from: BinFileTechnicalSpecificationsArray
subclass of: Restriction
  on property: isComprisedOf
  some values from: CsvFileTechnicalSpecificationsArray
subclass of: Restriction
  on property: isComprisedOf
  some values from: FileType
comment: Instances of this class contain the information to open/access/read and interprete a file's contents adequately.
definition origin: TriboData Team at IAM-CMS at KIT, Karlsruhe, Germany
friendly name: File Technical Specifications
persistent ID: TDO:0000433

FileType
type: Class
subclass of: ClassificationCategory
comment: Instances of this class give first information about file format/structure.
definition origin: TriboData Team at IAM-CMS at KIT, Karlsruhe, Germany
friendly name: File Type
persistent ID: TDO:0000130

FineVerticalTravelRange
type: Class
subclass of: CupGrindingMachineSpecification
subclass of: Restriction
  on property: hasQuantification
  some values from: DistanceMagnitude
comment: The travel range of the precise/fine/slow vertical drive of the machine's column (the distance in between lower limit and upper limit of the z-axis/vertical axis).
definition origin: TriboData Team at IAM-CMS at KIT, Karlsruhe, Germany
friendly name: Fine Vertical Travel Range
persistent ID: TDO:0000234

FineVerticalTravelResolution
type: Class
subclass of: CupGrindingMachineSpecification
subclass of: Restriction
  on property: hasQuantification
  some values from: DistanceMagnitude
comment: The resolution of the precise/fine/slow vertical drive of the machine's column (the step size of this drive).
definition origin: TriboData Team at IAM-CMS at KIT, Karlsruhe, Germany
friendly name: Fine Vertical Travel Resolution
persistent ID: TDO:0000235

FirstNames
type: Class
subclass of: OperatorPersonalIdentifiers
subclass of: Restriction
  on property: hasText
  some values from: string
comment: Operator's first name/s (= given name/s).
definition origin: TriboData Team at IAM-CMS at KIT, Karlsruhe, Germany
friendly name: First Name
persistent ID: TDO:0000168

FlashPointAcquisitionMethod
type: Class
subclass of: InterfacialMediumStandard
comment: Class containing information about the flashpoint acquisition of the interfacial medium.
definition origin: TriboData Team at IAM-CMS at KIT, Karlsruhe, Germany
friendly name: Flash Point Acquisition Method
persistent ID: TDO:0000533

Floor
type: Class
subclass of: Location
subclass of: Restriction
  on property: hasFloorNumber
  qualified cardinality: 1
  on data range: integer
comment: The floor in a building. Ground floor has value "0". First underground/basement floor has value "-1"
definition origin: TriboData Team at IAM-CMS at KIT, Karlsruhe, Germany
friendly name: Floor
persistent ID: TDO:0000528

FlowRateFractionMagnitude
type: Class
subclass of: PhysicalQuantity
subclass of: Restriction
  on property: hasPhysicalUnit
  some values from: FractionUnit
subclass of: Restriction
  on property: hasRationalNumberValue
  some values from: float
comment: The physical quantity that characterizes the phenomenon called flow rate as a fraction of what is possible.
definition origin: TriboData Team at IAM-CMS at KIT, Karlsruhe, Germany
friendly name: Flow Rate Fraction Magnitude
persistent ID: TDO:0000365

ForceMagnitude
type: Class
subclass of: PhysicalQuantity
subclass of: Restriction
  on property: hasPhysicalUnit
  some values from: ForceUnit
subclass of: Restriction
  on property: hasRationalNumberValue
  some values from: float
comment: The physical quantity that characterizes the phenomenon called force.
definition origin: TriboData Team at IAM-CMS at KIT, Karlsruhe, Germany
friendly name: Force Magnitude
persistent ID: TDO:0000536

ForceSetpointMagnitude
type: Class
subclass of: SetpointQuantity
subclass of: Restriction
  on property: hasPhysicalUnit
  some values from: ForceUnit
subclass of: Restriction
  on property: hasRationalNumberValue
  some values from: float
comment: The physical quantity that characterizes the phenomenon called force.
definition origin: TriboData Team at IAM-CMS at KIT, Karlsruhe, Germany
friendly name: Force Setpoint Magnitude
persistent ID: TDO:0000375

ForceUnit
type: Class
subclass of: ConversionTargetUnit
subclass of: PhysicalQuantityUnit
comment: The unit that locks the meaning of the amount of the phenomenon of force.
definition origin: TriboData Team at IAM-CMS at KIT, Karlsruhe, Germany
friendly name: Force Unit
persistent ID: TDO:0000109

FractionUnit
type: Class
subclass of: ConversionTargetUnit
subclass of: PhysicalQuantityUnit
comment: The unit that locks the meaning of fractional amount of a magnitude. The % sign is recognized in the SI of units to mean 0.01.
definition origin: TriboData Team at IAM-CMS at KIT, Karlsruhe, Germany
friendly name: Fraction Unit
persistent ID: TDO:0000110

FrequencyMagnitude
type: Class
subclass of: PhysicalQuantity
subclass of: Restriction
  on property: hasPhysicalUnit
  some values from: FrequencyUnit
subclass of: Restriction
  on property: hasRationalNumberValue
  some values from: float
comment: The physical quantity that characterizes the quantity called frequency.
definition origin: TriboData Team at IAM-CMS at KIT, Karlsruhe, Germany
friendly name: Frequency Magnitude
persistent ID: TDO:0000366

FrequencyUnit
type: Class
subclass of: ConversionTargetUnit
subclass of: PhysicalQuantityUnit
comment: The unit that locks the meaning of the magnitude of frequency magnitude.
definition origin: TriboData Team at IAM-CMS at KIT, Karlsruhe, Germany
friendly name: Frequency Unit
persistent ID: TDO:0000111

Furnace
type: Class
subclass of: PoweredMachine
subclass of: Restriction
  on property: hasIdentifier
  some values from: EquipmentGeneralIdentifyingInformation
subclass of: Restriction
  on property: hasTechnicalSpecification
  some values from: FurnaceSpecificationsArray
comment: Objects of this class pertain to the category of machines called furnace.
contextual type: LabEquipmentType
definition origin: TriboData Team at IAM-CMS at KIT, Karlsruhe, Germany
friendly name: Furnace
persistent ID: TDO:0000520

FurnaceCoolingRateSpecification
type: Class
subclass of: FurnaceRelatedCollective
subclass of: Restriction
  on property: isComprisedOf
  some values from: FurnaceCoolingRateSpecificationTuple
comment: Class containing information about the furnace's cooling time to room temperature.
definition origin: TriboData Team at IAM-CMS at KIT, Karlsruhe, Germany
friendly name: Cooling Rate Specifications
persistent ID: TDO:0000465

FurnaceCoolingRateSpecificationTuple
type: Class
subclass of: FurnaceRelatedCollective
subclass of: Restriction
  on property: isComprisedOf
  some values from: DurationToTemperature
subclass of: Restriction
  on property: isComprisedOf
  some values from: StartingTemperatureSetpoint
comment: Class containing information about the furnace's cooling time to room temperature.
definition origin: TriboData Team at IAM-CMS at KIT, Karlsruhe, Germany
friendly name: List Item (Cooling Rate Tuple)
persistent ID: TDO:0000466

FurnaceHeatingRateSpecification
type: Class
subclass of: FurnaceRelatedCollective
subclass of: Restriction
  on property: isComprisedOf
  some values from: FurnaceHeatingRateSpecificationTuple
comment: Class containing information about the furnace's heating time to temperature.
definition origin: TriboData Team at IAM-CMS at KIT, Karlsruhe, Germany
friendly name: Heating Rate Specifications
persistent ID: TDO:0000467

FurnaceHeatingRateSpecificationTuple
type: Class
subclass of: FurnaceRelatedCollective
subclass of: Restriction
  on property: isComprisedOf
  some values from: DurationToTemperature
subclass of: Restriction
  on property: isComprisedOf
  some values from: TargetTemperatureSetpoint
comment: Class containing information about the furnace's heating time to temperature.
definition origin: TriboData Team at IAM-CMS at KIT, Karlsruhe, Germany
friendly name: List Item (Heating Rate Tuple)
persistent ID: TDO:0000468

FurnaceOperatingSpaceSpecificationsArray
type: Class
subclass of: FurnaceRelatedCollective
subclass of: Restriction
  on property: isComprisedOf
  some values from: FurnaceSpaceHeight
subclass of: Restriction
  on property: isComprisedOf
  some values from: FurnaceSpaceLength
subclass of: Restriction
  on property: isComprisedOf
  some values from: FurnaceSpaceWidth
comment: Class containing information about the furnace's available space for sample treatment.
definition origin: TriboData Team at IAM-CMS at KIT, Karlsruhe, Germany
friendly name: Operating Space Info
persistent ID: TDO:0000469

FurnaceSpaceHeight
type: Class
subclass of: FurnaceSpecification
subclass of: Restriction
  on property: hasQuantification
  some values from: DistanceMagnitude
comment: The maximum height inside the chamber of a furnace.
definition origin: TriboData Team at IAM-CMS at KIT, Karlsruhe, Germany
friendly name: Space Height
persistent ID: TDO:0000248

FurnaceSpaceLength
type: Class
subclass of: FurnaceSpecification
subclass of: Restriction
  on property: hasQuantification
  some values from: DistanceMagnitude
comment: The maximum length inside the chamber of a furnace.
definition origin: TriboData Team at IAM-CMS at KIT, Karlsruhe, Germany
friendly name: Space Length
persistent ID: TDO:0000249

FurnaceSpaceWidth
type: Class
subclass of: FurnaceSpecification
subclass of: Restriction
  on property: hasQuantification
  some values from: DistanceMagnitude
comment: The maximum width inside the chamber of a furnace.
definition origin: TriboData Team at IAM-CMS at KIT, Karlsruhe, Germany
friendly name: Space Width
persistent ID: TDO:0000250

FurnaceSpecificationsArray
type: Class
subclass of: FurnaceRelatedCollective
subclass of: Restriction
  on property: isComprisedOf
  some values from: FurnaceCoolingRateSpecification
subclass of: Restriction
  on property: isComprisedOf
  some values from: FurnaceHeatingRateSpecification
subclass of: Restriction
  on property: isComprisedOf
  some values from: FurnaceOperatingSpaceSpecificationsArray
subclass of: Restriction
  on property: isComprisedOf
  some values from: MaximumTemperatureSetting
subclass of: Restriction
  on property: isComprisedOf
  some values from: ObjectMass
subclass of: Restriction
  on property: isComprisedOf
  some values from: PowerSupplyVoltage
subclass of: Restriction
  on property: isComprisedOf
  some values from: PowerSupplyWattage
subclass of: Restriction
  on property: isComprisedOf
  some values from: SpecimenDeliveryMethod
subclass of: Restriction
  on property: isComprisedOf
  some values from: SurroundingMediumContolMethod
subclass of: Restriction
  on property: isComprisedOf
  some values from: TemperatureControlDevice
subclass of: Restriction
  on property: isComprisedOf
  some values from: TemperatureControlMethod
comment: Class containing information about the technical specifications of a furnace.
definition origin: TriboData Team at IAM-CMS at KIT, Karlsruhe, Germany
friendly name: Technical Specifications
persistent ID: TDO:0000470

GrindingToolType
type: Class
subclass of: ClassificationCategory
comment: Instances of this class give the type of grinding tool used by equipment.
definition origin: TriboData Team at IAM-CMS at KIT, Karlsruhe, Germany
friendly name: Grinding Tool Type
persistent ID: TDO:0000131

Group
type: Class
subclass of: Collection
comment: A Collection of Agents, e.g. a flock of sheep, a herd of goats, or the local Boy Scout troop.
definition origin: SUMO Ontology (http://www.adampease.org/OP)

HardnessMagnitude
type: Class
subclass of: PhysicalQuantity
subclass of: Restriction
  on property: hasPhysicalUnit
  some values from: HardnessScaleUnit
subclass of: Restriction
  on property: hasRationalNumberValue
  some values from: float
comment: The physical quantity that characterizes the phenomenon called Hardness.
definition origin: TriboData Team at IAM-CMS at KIT, Karlsruhe, Germany
friendly name: Hardness Magnitude
persistent ID: TDO:0000367

HardnessMeasurement
type: Class
subclass of: DescriptiveProcess
subclass of: Restriction
  on property: characterizesSpecimen
  some values from: BlockSpecimen
subclass of: Restriction
  on property: employsEquipment
  some values from: HardnessTester
subclass of: Restriction
  on property: generatesFile
  some values from: File
subclass of: Restriction
  on property: hasFilesWithMetadata
  some values from: ExperimentOutputFileMetadataArray
subclass of: Restriction
  on property: hasIdentifier
  some values from: ProcessGeneralIdentifyingInformation
subclass of: Restriction
  on property: isControlledBy
  some values from: HardnessMeasurementInputsArray
subclass of: Restriction
  on property: isControlledBy
  some values from: UncontrolledEnvironmentalConditionsArray
subclass of: Restriction
  on property: physicallyModifies
  some values from: BlockSpecimen
comment: Class representing the monitored processes that produce a (set of) file(s) with various types whose contents indicate the hardness of a speciment based on indentation measurement.
contextual type: ScientificProcedureType
definition origin: TriboData Team at IAM-CMS at KIT, Karlsruhe, Germany
friendly name: Hardness Measurement
persistent ID: TDO:0000214

HardnessMeasurementInputsArray
type: Class
subclass of: CircumstancesCollective
subclass of: Restriction
  on property: isComprisedOf
  some values from: HardnessScaleUnit
subclass of: Restriction
  on property: isComprisedOf
  some values from: NumberOfScannedProfiles
subclass of: Restriction
  on property: isComprisedOf
  some values from: XOffsetBetweenMeasuredProfiles
subclass of: Restriction
  on property: isComprisedOf
  some values from: YOffsetBetweenMeasuredProfiles
subclass of: Restriction
  on property: isControlledBy
  some values from: HardnessMeasurementType
subclass of: Restriction
  on property: isControlledBy
  some values from: LensMagnification
subclass of: Restriction
  on property: isControlledBy
  some values from: LoadRelaxationSetpoint
subclass of: Restriction
  on property: isControlledBy
  some values from: NormalLoadSetpoint
comment: Class containing information about the parameters that are put into the involved scientific equipment to run it optimally.
definition origin: TriboData Team at IAM-CMS at KIT, Karlsruhe, Germany
friendly name: System/Setup Inputs
persistent ID: TDO:0000401

HardnessMeasurementType
type: Class
subclass of: ClassificationCategory
comment: Instances of this class specify the hardness measuring principle.
definition origin: TriboData Team at IAM-CMS at KIT, Karlsruhe, Germany
friendly name: Hardness Measurement Type
persistent ID: TDO:0000132

HardnessScaleUnit
type: Class
subclass of: ConversionTargetUnit
subclass of: PhysicalQuantityUnit
comment: The unit that locks the meaning of the amount of the phenomenon of hardness. This gives the scale used for the measurement.
definition origin: TriboData Team at IAM-CMS at KIT, Karlsruhe, Germany
friendly name: Hardness Scale
persistent ID: TDO:0000112

HardnessTester
type: Class
subclass of: PoweredMachine
subclass of: Restriction
  on property: hasIdentifier
  some values from: EquipmentGeneralIdentifyingInformation
subclass of: Restriction
  on property: hasTechnicalSpecification
  some values from: HardnessTesterSpecificationsArray
comment: Objects of this class pertain to the category of machines called hardness tester.
contextual type: LabEquipmentType
definition origin: TriboData Team at IAM-CMS at KIT, Karlsruhe, Germany
friendly name: Hardness Tester
persistent ID: TDO:0000521

HardnessTesterAvailableCameraViewsArray
type: Class
subclass of: HardnessTesterRelatedCollective
subclass of: Restriction
  on property: isComprisedOf
  some values from: CameraViewType
comment: Class containing information about the available hardness testing cameras of a hardness testing system.
definition origin: TriboData Team at IAM-CMS at KIT, Karlsruhe, Germany
friendly name: Available Hardness Testing Cameras Array
persistent ID: TDO:0000471

HardnessTesterAvailableIntentersArray
type: Class
subclass of: HardnessTesterRelatedCollective
subclass of: Restriction
  on property: isComprisedOf
  some values from: IndenterType
comment: Class containing information about the available hardness testing indenters of a hardness testing system.
definition origin: TriboData Team at IAM-CMS at KIT, Karlsruhe, Germany
friendly name: List of Available Hardness Measurement Types
persistent ID: TDO:0000472

HardnessTesterAvailableLensesArray
type: Class
subclass of: HardnessTesterRelatedCollective
subclass of: Restriction
  on property: isComprisedOf
  some values from: LensMagnification
comment: Class containing information about the available hardness testing lenses of a hardness testing system.
definition origin: TriboData Team at IAM-CMS at KIT, Karlsruhe, Germany
friendly name: Available Hardness Testing Lenses Array
persistent ID: TDO:0000473

HardnessTesterConnectedPCInfoArray
type: Class
subclass of: HardnessTesterRelatedCollective
subclass of: Restriction
  on property: isComprisedOf
  some values from: EquipmentID
subclass of: Restriction
  on property: isComprisedOf
  some values from: OperatingSystemName
comment: Class containing information about the PC's connected to a tribometer.
definition origin: TriboData Team at IAM-CMS at KIT, Karlsruhe, Germany
friendly name: Array of Connected PC's
persistent ID: TDO:0000474

HardnessTesterDimensionsArray
type: Class
subclass of: HardnessTesterRelatedCollective
subclass of: Restriction
  on property: isComprisedOf
  some values from: ObjectHeight
subclass of: Restriction
  on property: isComprisedOf
  some values from: ObjectLength
subclass of: Restriction
  on property: isComprisedOf
  some values from: ObjectWidth
comment: Class containing information about the dimensions of a hardness tester.
definition origin: TriboData Team at IAM-CMS at KIT, Karlsruhe, Germany
friendly name: Machine Dimensions
persistent ID: TDO:0000475

HardnessTesterSpecificationsArray
type: Class
subclass of: HardnessTesterRelatedCollective
subclass of: Restriction
  on property: isComprisedOf
  some values from: HardnessTesterAvailableCameraViewsArray
subclass of: Restriction
  on property: isComprisedOf
  some values from: HardnessTesterAvailableIntentersArray
subclass of: Restriction
  on property: isComprisedOf
  some values from: HardnessTesterAvailableLensesArray
subclass of: Restriction
  on property: isComprisedOf
  some values from: HardnessTesterConnectedPCInfoArray
subclass of: Restriction
  on property: isComprisedOf
  some values from: HardnessTesterDimensionsArray
subclass of: Restriction
  on property: isComprisedOf
  some values from: HardnessTesterXYTableSubsystemSpecificationsArray
subclass of: Restriction
  on property: isComprisedOf
  some values from: LoadApplicationMethod
subclass of: Restriction
  on property: isComprisedOf
  some values from: MaximumAvailableNorlmalLoad
subclass of: Restriction
  on property: isComprisedOf
  some values from: MinimumAvailableNorlmalLoad
subclass of: Restriction
  on property: isComprisedOf
  some values from: ObjectMass
subclass of: Restriction
  on property: isComprisedOf
  some values from: PowerSupplyVoltage
subclass of: Restriction
  on property: isComprisedOf
  some values from: PowerSupplyWattage
comment: Class containing information about the technical specifications of a hardness testing system.
definition origin: TriboData Team at IAM-CMS at KIT, Karlsruhe, Germany
friendly name: Technical Specifications
persistent ID: TDO:0000477

HardnessTesterXYTableSubsystemSpecificationsArray
type: Class
subclass of: HardnessTesterRelatedCollective
subclass of: Restriction
  on property: isComprisedOf
  some values from: EquipmentName
subclass of: Restriction
  on property: isComprisedOf
  some values from: MotionDeliveryMethod
subclass of: Restriction
  on property: isComprisedOf
  some values from: WorkingAreaLength
subclass of: Restriction
  on property: isComprisedOf
  some values from: WorkingAreaWidth
subclass of: Restriction
  on property: isComprisedOf
  some values from: XTravelRange
subclass of: Restriction
  on property: isComprisedOf
  some values from: YTravelRange
comment: Class containing information about the XY table of a hardness testing system.
definition origin: TriboData Team at IAM-CMS at KIT, Karlsruhe, Germany
friendly name: XY Table Specifications
persistent ID: TDO:0000478

HeatTreatmentDurationSetpoint
type: Class
subclass of: HeatTreatmentProcessSeeting
subclass of: Restriction
  on property: hasQuantification
  some values from: TimeDuration
comment: The duration setting assigned to be maintained by the machine in a heating process.
definition origin: TriboData Team at IAM-CMS at KIT, Karlsruhe, Germany
friendly name: Duration Setpoint
persistent ID: TDO:0000308

HeatTreatmentGoal
type: Class
subclass of: ClassificationCategory
comment: Instances of this class specify the classification goal of heat treatment.
definition origin: TriboData Team at IAM-CMS at KIT, Karlsruhe, Germany
friendly name: Heat Treatment Goal
persistent ID: TDO:0000133

HeatTreatmentInputStepsArray
type: Class
subclass of: HeatTreatmentProcessArray
subclass of: Restriction
  on property: isComprisedOf
  some values from: HeatTreatmentVariableInputArrayItem
comment: Class containing the ordered list of sequential steps, in terms of parameters, specific to the process.
definition origin: TriboData Team at IAM-CMS at KIT, Karlsruhe, Germany
friendly name: Heat Treatment Steps Array
persistent ID: TDO:0000402

HeatTreatmentProcess
type: Class
subclass of: IndustrialProcess
subclass of: Restriction
  on property: employsEquipment
  some values from: Furnace
subclass of: Restriction
  on property: hasIdentifier
  some values from: ProcessGeneralIdentifyingInformation
subclass of: Restriction
  on property: hasSummary
  some values from: HeatTreatmentSummaryArray
subclass of: Restriction
  on property: isComprisedOf
  some values from: HeatTreatmentInputStepsArray
subclass of: Restriction
  on property: isControlledBy
  some values from: UncontrolledEnvironmentalConditionsArray
subclass of: Restriction
  on property: physicallyModifies
  some values from: BlockSpecimen
comment: Class representing the physical process of thermal treatment of a specimen with the aim of changing its selfcontained physical characteristcs.
contextual type: IndustrialProcedureType
definition origin: TriboData Team at IAM-CMS at KIT, Karlsruhe, Germany
friendly name: Heat Treatment
persistent ID: TDO:0000212

HeatTreatmentSummaryArray
type: Class
subclass of: HeatTreatmentProcessArray
subclass of: Restriction
  on property: isComprisedOf
  some values from: Comment
subclass of: Restriction
  on property: isComprisedOf
  some values from: HeatTreatmentType
comment: Class containing derived information about the process. All derived information stems from the information recorded in other locations of the record.
definition origin: TriboData Team at IAM-CMS at KIT, Karlsruhe, Germany
friendly name: Process Summary
persistent ID: TDO:0000403

HeatTreatmentType
type: Class
subclass of: ClassificationCategory
comment: Instances of this class specify the classification type of heat treatment.
definition origin: TriboData Team at IAM-CMS at KIT, Karlsruhe, Germany
friendly name: Heat Treatment Type
persistent ID: TDO:0000134

HeatTreatmentVariableInputArrayItem
type: Class
subclass of: HeatTreatmentProcessArray
subclass of: Restriction
  on property: isComprisedOf
  some values from: HeatTreatmentDurationSetpoint
subclass of: Restriction
  on property: isComprisedOf
  some values from: HeatTreatmentGoal
subclass of: Restriction
  on property: isComprisedOf
  some values from: SequentialOrderPosition
subclass of: Restriction
  on property: isComprisedOf
  some values from: SurroundingMediumType
subclass of: Restriction
  on property: isComprisedOf
  some values from: TargetTemperatureSetpoint
comment: Class containing a bundle of parameters needed for a heat treatment process.
definition origin: TriboData Team at IAM-CMS at KIT, Karlsruhe, Germany
friendly name: List Item (Variable Heat Treatment Step)
persistent ID: TDO:0000404

HousingMethod
type: Class
subclass of: DeliveryMethod
comment: This objects of this class specify if the equipment is equipped with a climate box around the investigated scientific process (fixed installation — not improvised solutions). This allows users to filter for pieces of equipment that in general allow experiments in thouroughly controlled environments.
definition origin: TriboData Team at IAM-CMS at KIT, Karlsruhe, Germany
friendly name: Housing Method
persistent ID: TDO:0000189

IPClass
type: Class
subclass of: EquipmentRelatedName
comment: Instances of this class characterize the IP class of a machine.
definition origin: TriboData Team at IAM-CMS at KIT, Karlsruhe, Germany
friendly name: Protection Class
persistent ID: TDO:0000154

ISOStandard
type: Class
subclass of: InterfacialMediumStandard
comment: Class containing information about the technical standard of the interfacial medium.
definition origin: TriboData Team at IAM-CMS at KIT, Karlsruhe, Germany
friendly name: ISO Standard
persistent ID: TDO:0000218

IndenterType
type: Class
subclass of: ClassificationCategory
comment: Instances of this class specify the indenter type/geometry.
definition origin: TriboData Team at IAM-CMS at KIT, Karlsruhe, Germany
friendly name: List Item (Indenter Type)
persistent ID: TDO:0000135

IndustrialProcess
type: Class
subclass of: Procedure
comment: Industrial processes are procedures involving chemical, physical, electrical or mechanical steps to aid in the manufacturing of an item or items, usually carried out on a very large scale. Industrial processes are the key components of heavy industry. FROM https://en.wikipedia.org/wiki/Industrial_processes
comment: The processes that have as a purpose preparations before a Scientific Experiment.
definition origin: tribAIn Ontology (https://github.com/snow0815/tribAIn)
persistent ID: TDO:0000208

Axiom
annotated source: IndustrialProcess
annotated property: comment
annotated target: The processes that have as a purpose preparations before a Scientific Experiment.
definition origin: TriboData Team at IAM-CMS at KIT, Karlsruhe, Germany

InfeedMode
type: Class
subclass of: DeliveryMethod
comment: Instances of this class indicate the type of infeed method.
definition origin: TriboData Team at IAM-CMS at KIT, Karlsruhe, Germany
friendly name: Infeed Mode
persistent ID: TDO:0000190

InitialAmountOfInterfacialMedium
type: Class
subclass of: TribologicalExperimentSetting
subclass of: Restriction
  on property: hasQuantification
  some values from: VolumeSetpointMagnitude
comment: The initial amount of interfacial medium supplied to a process.
definition origin: TriboData Team at IAM-CMS at KIT, Karlsruhe, Germany
friendly name: Initial Amount of Interfacial Medium
persistent ID: TDO:0000325

InstitutionLocation
type: Class
subclass of: Location
comment: The premises on which an object exists or a process happens. *Not to be confused with an institution as an organization, or as an employer.
definition origin: TriboData Team at IAM-CMS at KIT, Karlsruhe, Germany
friendly name: Institution (Location)
persistent ID: TDO:0000529

InterfacialMedium
type: Class
subclass of: ExperimentalObject
subclass of: Restriction
  on property: hasIdentifier
  some values from: InterfacialMediumGeneralIdentifyingInformation
subclass of: Restriction
  on property: hasTechnicalSpecification
  some values from: InterfacialMediumSpecificationsArray
comment: Objects of this class act as the immediate medium at the tribological interface, which is not the surrounding medium of the instrument as a whole.
contextual type: ExperimentalObjectType
definition origin: TriboData Team at IAM-CMS at KIT, Karlsruhe, Germany
friendly name: Interfacial Medium
persistent ID: TDO:0000514

InterfacialMediumCategory
type: Class
subclass of: ClassificationCategory
comment: The lubricant class which interfacial medium fits into best.
definition origin: TriboData Team at IAM-CMS at KIT, Karlsruhe, Germany
friendly name: Material Category
persistent ID: TDO:0000136

InterfacialMediumFlashPointSpecsArray
type: Class
subclass of: InterfacialMediumRelatedCollective
subclass of: Restriction
  on property: isComprisedOf
  some values from: InterfacialMediumFlashPointSpecsArrayItem
comment: Class containing information about the flash point the piece of interfacial medium.
definition origin: TriboData Team at IAM-CMS at KIT, Karlsruhe, Germany
friendly name: Flash Point Specifications
persistent ID: TDO:0000479

InterfacialMediumFlashPointSpecsArrayItem
type: Class
subclass of: InterfacialMediumRelatedCollective
subclass of: Restriction
  on property: isComprisedOf
  some values from: FlashPointAcquisitionMethod
subclass of: Restriction
  on property: isComprisedOf
  some values from: ObjectFlashPoint
comment: Class containing information about the flash point the piece of interfacial medium.
definition origin: TriboData Team at IAM-CMS at KIT, Karlsruhe, Germany
friendly name: List Item (Flash Point Specification)
persistent ID: TDO:0000480

InterfacialMediumGeneralIdentifyingInformation
type: Class
subclass of: IdentificatoryCollective
subclass of: Restriction
  on property: isComprisedOf
  some values from: LocationInformation
subclass of: Restriction
  on property: isComprisedOf
  some values from: ManufacturerName
subclass of: Restriction
  on property: isComprisedOf
  some values from: ObjectModelName
subclass of: Restriction
  on property: isComprisedOf
  some values from: OperatorPersonalInformation
subclass of: Restriction
  on property: isComprisedOf
  some values from: SpecimenID
comment: Objects of this class contain information that unequivocally identifies a piece of interfacial medium.
definition origin: TriboData Team at IAM-CMS at KIT, Karlsruhe, Germany
friendly name: General Info
persistent ID: TDO:0000439

InterfacialMediumKinematicViscositySpecsArray
type: Class
subclass of: InterfacialMediumRelatedCollective
subclass of: Restriction
  on property: isComprisedOf
  some values from: InterfacialMediumKinematicViscositySpecsArrayItem
comment: Class containing information about the kinematic viscosity of the piece of interfacial medium.
definition origin: TriboData Team at IAM-CMS at KIT, Karlsruhe, Germany
friendly name: Kinematic Viscosity Specifications
persistent ID: TDO:0000481

InterfacialMediumKinematicViscositySpecsArrayItem
type: Class
subclass of: InterfacialMediumRelatedCollective
subclass of: Restriction
  on property: isComprisedOf
  some values from: ObjectKinematicViscosity
subclass of: Restriction
  on property: isComprisedOf
  some values from: ObjectKinematicViscosityAcquisitionTemperature
comment: Class containing information about the kinematic viscosity of the piece of interfacial medium.
definition origin: TriboData Team at IAM-CMS at KIT, Karlsruhe, Germany
friendly name: List Item (Kinematic Viscosity)
persistent ID: TDO:0000482

InterfacialMediumMassDensitySpecsArray
type: Class
subclass of: InterfacialMediumRelatedCollective
subclass of: Restriction
  on property: isComprisedOf
  some values from: InterfacialMediumMassDensitySpecsArrayItem
comment: Class containing information about the mass density of the the piece of interfacial medium.
definition origin: TriboData Team at IAM-CMS at KIT, Karlsruhe, Germany
friendly name: Mass Density Specifications
persistent ID: TDO:0000483

InterfacialMediumMassDensitySpecsArrayItem
type: Class
subclass of: InterfacialMediumRelatedCollective
subclass of: Restriction
  on property: isComprisedOf
  some values from: ObjectMassDensity
subclass of: Restriction
  on property: isComprisedOf
  some values from: ObjectMassDensityAcquisitionTemperature
comment: Class containing information about the mass density of the the piece of interfacial medium.
definition origin: TriboData Team at IAM-CMS at KIT, Karlsruhe, Germany
friendly name: List Item (Mass Density Specification)
persistent ID: TDO:0000484

InterfacialMediumReplenishmentRateSetpoint
type: Class
subclass of: TribologicalExperimentSetting
subclass of: Restriction
  on property: hasQuantification
  some values from: VolumetricRateSetpointMagnitude
comment: The amount of interfacial medium supplied to a process per time, when continuous replenishment setting is used.
definition origin: TriboData Team at IAM-CMS at KIT, Karlsruhe, Germany
friendly name: Replenishment Rate
persistent ID: TDO:0000326

InterfacialMediumSourcingMethod
type: Class
subclass of: DeliveryMethod
comment: Source of supply of the interfacial medium during an industrial or scientific process, where replenishment occurs. Could be for lubrication and/or cooling purposes.
definition origin: TriboData Team at IAM-CMS at KIT, Karlsruhe, Germany
friendly name: Interfacial Medium Source of Replenishment
persistent ID: TDO:0000191

InterfacialMediumSpecificationsArray
type: Class
subclass of: InterfacialMediumRelatedCollective
subclass of: Restriction
  on property: isComprisedOf
  some values from: InterfacialMediumCategory
subclass of: Restriction
  on property: isComprisedOf
  some values from: InterfacialMediumFlashPointSpecsArray
subclass of: Restriction
  on property: isComprisedOf
  some values from: InterfacialMediumMassDensitySpecsArray
subclass of: Restriction
  on property: isComprisedOf
  some values from: InterfacialMediumStandardsArray
subclass of: Restriction
  on property: isComprisedOf
  some values from: InterfacialMediumViscositySpecsArray
subclass of: Restriction
  on property: isComprisedOf
  some values from: ObjectPourPoint
comment: Class containing information about the technical specifications of a piece of interfacial medium.
definition origin: TriboData Team at IAM-CMS at KIT, Karlsruhe, Germany
friendly name: Technical Specifications
persistent ID: TDO:0000485

InterfacialMediumStandardsArray
type: Class
subclass of: InterfacialMediumRelatedCollective
subclass of: Restriction
  on property: isComprisedOf
  some values from: BoschStandard
subclass of: Restriction
  on property: isComprisedOf
  some values from: CAVStandard
subclass of: Restriction
  on property: isComprisedOf
  some values from: ISOStandard
subclass of: Restriction
  on property: isComprisedOf
  some values from: MANStandard
subclass of: Restriction
  on property: isComprisedOf
  some values from: MercedesBenzStandard
subclass of: Restriction
  on property: isComprisedOf
  some values from: SAEStandard
comment: Class containing information about the technical stadards observed by the piece of interfacial medium.
definition origin: TriboData Team at IAM-CMS at KIT, Karlsruhe, Germany
friendly name: Technical Standards
persistent ID: TDO:0000487

InterfacialMediumSupplyContinuityMethod
type: Class
subclass of: DeliveryMethod
comment: Continuity of supply of the interfacial medium during an industrial or scientific process, where replenishment occurs. Could be for lubrication and/or cooling purposes.
definition origin: TriboData Team at IAM-CMS at KIT, Karlsruhe, Germany
friendly name: Interfacial Medium Supply Continuity
persistent ID: TDO:0000192

InterfacialMediumSupplyMethod
type: Class
subclass of: DeliveryMethod
comment: Way of supply of the interfacial medium during an industrial or scientific process. Could be for lubrication and/or cooling purposes.
definition origin: TriboData Team at IAM-CMS at KIT, Karlsruhe, Germany
friendly name: Interfacial Medium Supply Method
persistent ID: TDO:0000193

InterfacialMediumViscositySpecsArray
type: Class
subclass of: InterfacialMediumRelatedCollective
subclass of: Restriction
  on property: isComprisedOf
  some values from: InterfacialMediumKinematicViscositySpecsArray
comment: Class containing information about the viscosity of the the piece of interfacial medium.
definition origin: TriboData Team at IAM-CMS at KIT, Karlsruhe, Germany
friendly name: Viscosity Specifications
persistent ID: TDO:0000486

Kadi4MatRecord
type: Class
subclass of: ScientificEntityRecord
subclass of: Restriction
  on property: documentsDescriptionOf
  some values from: Comment
subclass of: Restriction
  on property: documentsDescriptionOf
  some values from: Class
    union of: BandSaw
    union of: BlockSpecimen
    union of: CommercialMachiningProcess
    union of: CupGrindingMachine
    union of: CupGrindingProcess
    union of: DataProcessing
    union of: DemagnetizationProcess
    union of: DemagnetizingPlate
    union of: Furnace
    union of: HardnessMeasurement
    union of: HardnessTester
    union of: HeatTreatmentProcess
    union of: InterfacialMedium
    union of: MetalSawingProcess
    union of: OpticalSurfaceProfilometer
    union of: OpticalSurfaceProfilometry
    union of: SpecimenCleaningProcess
    union of: TactileSurfaceProfilometer
    union of: TactileSurfaceProfilometry
    union of: TribologicalExperiment
    union of: Tribometer
    union of: UltrasonicCleaner
subclass of: Restriction
  on property: hasIdentifier
  some values from: Kadi4MatRecordMetadata
comment: Objects of this class contain information about a monitored scientific process.
definition origin: TriboData Team at IAM-CMS at KIT, Karlsruhe, Germany
friendly name: Kadi4Mat Record
persistent ID: TDO:0000448

Kadi4MatRecordMetadata
type: Class
subclass of: MetadataCollective
subclass of: Restriction
  on property: isComprisedOf
  some values from: FileCreatedTime
subclass of: Restriction
  on property: isComprisedOf
  some values from: FileModifiedTime
subclass of: Restriction
  on property: isComprisedOf
  some values from: Kadi4MatRecordPersistentID
subclass of: Restriction
  on property: isComprisedOf
  some values from: Kadi4MatRecordTags
subclass of: Restriction
  on property: isComprisedOf
  some values from: Kadi4MatRecordTitle
subclass of: Restriction
  on property: isComprisedOf
  some values from: Kadi4MatRecordType
subclass of: Restriction
  on property: isComprisedOf
  some values from: Kadi4MatRecordVisibility
comment: Instances of this class allow Kadi4Mat Records to be uniquely identified.
definition origin: TriboData Team at IAM-CMS at KIT, Karlsruhe, Germany
friendly name: Record Metadata
persistent ID: TDO:0000445

Kadi4MatRecordPersistentID
type: Class
subclass of: Name
subclass of: Restriction
  on property: hasText
  some values from: string
comment: Record ID generated according to a defined set of rules.
definition origin: TriboData Team at IAM-CMS at KIT, Karlsruhe, Germany
friendly name: Record Persistent ID
persistent ID: TDO:0000166

Kadi4MatRecordTags
type: Class
subclass of: Name
comment: Tags that aid in assigning extra attributes for the identification of a record.
definition origin: TriboData Team at IAM-CMS at KIT, Karlsruhe, Germany
friendly name: Tags
persistent ID: TDO:0000167

Kadi4MatRecordTitle
type: Class
subclass of: Title
subclass of: Restriction
  on property: hasText
  some values from: string
comment: Title of the record chosen by the operator/generated according to a set of rules. Record Name follows the following recipe: o Class Friendly Name + Your Name of Choice + Optional Counter  The Class Friendly Name comes from the ontology  Your name of choice is only for the users’ convenience, so it could be any that doesn’t result in a repeated Record title  The counter starts with a number sign and is followed by 4-digit sequential number with leading zeros For example:  Interfacial Medium Shell V 1404 #0001
definition origin: TriboData Team at IAM-CMS at KIT, Karlsruhe, Germany
friendly name: Record Title
persistent ID: TDO:0000178

Kadi4MatRecordType
type: Class
subclass of: ClassificationCategory
comment: Instances of this class give first information about record's type. Types of records in Kadi4Mat: o Lab Equipment o Industrial Procedure o Scientific Procedure o Data Processing o Experimental Object
definition origin: TriboData Team at IAM-CMS at KIT, Karlsruhe, Germany
friendly name: Type
persistent ID: TDO:0000137

Kadi4MatRecordVisibility
type: Class
subclass of: ClassificationCategory
comment: Instances of this class give first information about record's visibility.
definition origin: TriboData Team at IAM-CMS at KIT, Karlsruhe, Germany
friendly name: Visibility
persistent ID: TDO:0000138

KinematicViscosityMagnitude
type: Class
subclass of: PhysicalQuantity
subclass of: Restriction
  on property: hasPhysicalUnit
  some values from: KinematicViscosityUnit
subclass of: Restriction
  on property: hasRationalNumberValue
  some values from: float
comment: The physical quantity that characterizes the phenomenon called Kinematic Viscosity.
definition origin: TriboData Team at IAM-CMS at KIT, Karlsruhe, Germany
friendly name: Kinematic Viscosity Magnitude
persistent ID: TDO:0000368

KinematicViscosityUnit
type: Class
subclass of: ConversionTargetUnit
subclass of: PhysicalQuantityUnit
comment: The unit that locks the meaning of the amount of the phenomenon of kinematic viscosity.
definition origin: TriboData Team at IAM-CMS at KIT, Karlsruhe, Germany
friendly name: Kinematic Viscosity Unit
persistent ID: TDO:0000113

LastName
type: Class
subclass of: OperatorPersonalIdentifiers
subclass of: Restriction
  on property: hasText
  some values from: string
comment: Operator's last name/s (= family name/s).
definition origin: TriboData Team at IAM-CMS at KIT, Karlsruhe, Germany
friendly name: Last Name
persistent ID: TDO:0000169

LensMagnification
type: Class
subclass of: EquipmentSpecification
subclass of: Restriction
  on property: hasQuantification
  some values from: MagnificationMagnitude
comment: Instances of this class specify the lens magnification.
definition origin: TriboData Team at IAM-CMS at KIT, Karlsruhe, Germany
friendly name: Lens Magnification
persistent ID: TDO:0000254

LoadApplicationMethod
type: Class
subclass of: DeliveryMethod
comment: The method (principle) of load application. For Tribometers, the way the normal load is applied can have a big influence on the tribologically induced processes in the frictional contact and the long-term evolution of the tribo-system (e.g. due to wear).
definition origin: TriboData Team at IAM-CMS at KIT, Karlsruhe, Germany
friendly name: Principle of Load Application
persistent ID: TDO:0000194

LoadRelaxationSetpoint
type: Class
subclass of: TribologicalExperimentSetting
subclass of: Restriction
  on property: hasQuantification
  some values from: TimeDuration
comment: The prescribed duration of relaxation of the induced load, in order for a system to stabilize prior to the start/end of the process.
definition origin: TriboData Team at IAM-CMS at KIT, Karlsruhe, Germany
friendly name: Relaxation Duration Setpoint
persistent ID: TDO:0000327

Location
type: Class
subclass of: PhysicalObject
comment: A physical location.
definition origin: TriboData Team at IAM-CMS at KIT, Karlsruhe, Germany
friendly name: Location

LocationInformation
type: Class
subclass of: IdentificatoryCollective
subclass of: Restriction
  on property: isComprisedOf
  some values from: Building
subclass of: Restriction
  on property: isComprisedOf
  some values from: Floor
subclass of: Restriction
  on property: isComprisedOf
  some values from: InstitutionLocation
subclass of: Restriction
  on property: isComprisedOf
  some values from: Room
comment: Class containing a collection of pieces of information about where a process occured, or an object typically resides or is stored.
definition origin: TriboData Team at IAM-CMS at KIT, Karlsruhe, Germany
friendly name: Location
persistent ID: TDO:0000440

MANStandard
type: Class
subclass of: InterfacialMediumStandard
comment: Class containing information about the technical standard of the interfacial medium.
definition origin: TriboData Team at IAM-CMS at KIT, Karlsruhe, Germany
friendly name: MAN Standard
persistent ID: TDO:0000219

MagneticFieldEmissionClassification
type: Class
subclass of: TechnicalStandard
comment: Class containing information about the technical standard emission observed by the magnetic field.
definition origin: TriboData Team at IAM-CMS at KIT, Karlsruhe, Germany
friendly name: Magnetic Field Emission Classification
persistent ID: TDO:0000222

MagneticFieldEmissionClassificationStandard
type: Class
subclass of: TechnicalStandard
comment: Class containing information about the technical standard observed by the magnetic field emission.
definition origin: TriboData Team at IAM-CMS at KIT, Karlsruhe, Germany
friendly name: Magnetic Field Emission Classification Standard
persistent ID: TDO:0000223

MagnificationMagnitude
type: Class
subclass of: PhysicalQuantity
subclass of: Restriction
  on property: hasPhysicalUnit
  some values from: MagnificationUnit
subclass of: Restriction
  on property: hasRationalNumberValue
  some values from: float
comment: The physical quantity that characterizes the phenomenon called magnification.
definition origin: TriboData Team at IAM-CMS at KIT, Karlsruhe, Germany
friendly name: Magnification Magnitude
persistent ID: TDO:0000369

MagnificationUnit
type: Class
subclass of: ConversionTargetUnit
subclass of: PhysicalQuantityUnit
comment: The unit that locks the meaning of the amount of the phenomenon called magnification.
definition origin: TriboData Team at IAM-CMS at KIT, Karlsruhe, Germany
friendly name: Magnification Unit
persistent ID: TDO:0000114

ManufacturerName
type: Class
subclass of: EquipmentRelatedName
subclass of: InterfacialMediumRelatedName
subclass of: OrganizationName
subclass of: SpecimenRelatedName
comment: The official name of the insitution where the object was manufactured.
definition origin: TriboData Team at IAM-CMS at KIT, Karlsruhe, Germany
friendly name: Company/Vendor Name
persistent ID: TDO:0000155

MassDensityMagnitude
type: Class
subclass of: PhysicalQuantity
subclass of: Restriction
  on property: hasPhysicalUnit
  some values from: MassDensityUnit
subclass of: Restriction
  on property: hasRationalNumberValue
  some values from: float
comment: The physical quantity that characterizes the quantity called Mass Density.
definition origin: TriboData Team at IAM-CMS at KIT, Karlsruhe, Germany
friendly name: Mass Density Magnitude

MassDensityUnit
type: Class
subclass of: ConversionTargetUnit
subclass of: PhysicalQuantityUnit
comment: The unit that locks the meaning of the magnitude of the phenomenon of mass density.
definition origin: TriboData Team at IAM-CMS at KIT, Karlsruhe, Germany
friendly name: Mass Density Unit
persistent ID: TDO:0000115

MassSetpointMagnitude
type: Class
subclass of: SetpointQuantity
subclass of: Restriction
  on property: hasPhysicalUnit
  some values from: MassUnit
subclass of: Restriction
  on property: hasRationalNumberValue
  some values from: float
comment: The physical quantity that characterizes the phenomenon called mass.
definition origin: TriboData Team at IAM-CMS at KIT, Karlsruhe, Germany
friendly name: Mass Magnitude
persistent ID: TDO:0000376

MassUnit
type: Class
subclass of: ConversionTargetUnit
subclass of: PhysicalQuantityUnit
comment: The unit that locks the meaning of the magnitude of the phenomenon of mass.
definition origin: TriboData Team at IAM-CMS at KIT, Karlsruhe, Germany
friendly name: Mass Unit
persistent ID: TDO:0000116

MaterialCategory
type: Class
subclass of: ClassificationCategory
comment: The material class which block specimen fits into best.
definition origin: TriboData Team at IAM-CMS at KIT, Karlsruhe, Germany
friendly name: Material Category
persistent ID: TDO:0000139

MaterialEmpiricalFormula
type: Class
subclass of: SpecimenRelatedName
comment: In chemistry, the empirical formula of a chemical compound is the simplest positive integer ratio of atoms present in a compound.
definition origin: TriboData Team at IAM-CMS at KIT, Karlsruhe, Germany
friendly name: Material Empirical Formula
persistent ID: TDO:0000175

MaterialFerromagnetism
type: Class
subclass of: ClassificationCategory
subclass of: Restriction
  on property: hasBoolean
  some values from: boolean
comment: Information on whether the material is ferromagnetic or not. The magnetic state (or magnetic phase) of a material depends on temperature, pressure, and the applied magnetic field. A material may exhibit more than one form of magnetism as these variables change.
definition origin: TriboData Team at IAM-CMS at KIT, Karlsruhe, Germany
friendly name: Is Specimen Material Ferromagnetic
persistent ID: TDO:0000140

MaterialName
type: Class
subclass of: SpecimenRelatedName
comment: The type of material and the way it is referred to. The friendly way to identify it.
definition origin: TriboData Team at IAM-CMS at KIT, Karlsruhe, Germany
friendly name: Material Name
persistent ID: TDO:0000176

MaximumAvailableNorlmalLoad
type: Class
subclass of: EquipmentSpecification
subclass of: Restriction
  on property: hasQuantification
  some values from: ForceSetpointMagnitude
comment: Instances of this class represent the maximum permissable normal load.
definition origin: TriboData Team at IAM-CMS at KIT, Karlsruhe, Germany
friendly name: Maximum Normal Load
persistent ID: TDO:0000255

MaximumDurationSetpoint
type: Class
subclass of: EquipmentSpecification
subclass of: Restriction
  on property: hasQuantification
  some values from: TimeDuration
comment: Instances of this class characterize the maximum permissible duration for a process maintained by a machine.
definition origin: TriboData Team at IAM-CMS at KIT, Karlsruhe, Germany
friendly name: Maximum Duration
persistent ID: TDO:0000256

MaximumMeasurementSpeed
type: Class
subclass of: ProfilometerSpecifications
subclass of: Restriction
  on property: hasQuantification
  some values from: SpeedSetpointMagnitude
comment: Instances of this class represent the maximum permissable measument speed.
definition origin: TriboData Team at IAM-CMS at KIT, Karlsruhe, Germany
friendly name: Maximum Measurement Speed
persistent ID: TDO:0000262

MaximumPositioningSystemTurningSpeedSetpoint
type: Class
subclass of: CupGrindingProcessSetting
subclass of: Restriction
  on property: hasQuantification
  some values from: AngularVelocitySetpointMagnitude
comment: Instances of this class characterize the maximum permissable turning speed.
definition origin: TriboData Team at IAM-CMS at KIT, Karlsruhe, Germany
friendly name: Maximum Positioning System Turning Speed
persistent ID: TDO:0000291

MaximumSpecimenHeightWithCeramicCup
type: Class
subclass of: CupGrindingMachineSpecification
subclass of: Restriction
  on property: hasQuantification
  some values from: DistanceMagnitude
comment: The maximum height a workpiece/sample is allowed to have when a (previously unused) ceramic grinding cup is mounted.
definition origin: TriboData Team at IAM-CMS at KIT, Karlsruhe, Germany
friendly name: Maximum Specimen Height With Ceramic Cup Mounted
persistent ID: TDO:0000236

MaximumSpecimenHeightWithDiamondCup
type: Class
subclass of: CupGrindingMachineSpecification
subclass of: Restriction
  on property: hasQuantification
  some values from: DistanceMagnitude
comment: The maximum height a workpiece/sample is allowed to have when a (previously unused) diamond grinding cup is mounted.
definition origin: TriboData Team at IAM-CMS at KIT, Karlsruhe, Germany
friendly name: Maximum Specimen Height With Diamond Cup Mounted
persistent ID: TDO:0000237

MaximumSpecimenThickness
type: Class
subclass of: DemagnetizingPlateSpecification
subclass of: Restriction
  on property: hasQuantification
  some values from: DistanceMagnitude
comment: The specification of an object defining its thickness.
definition origin: TriboData Team at IAM-CMS at KIT, Karlsruhe, Germany
friendly name: Maximum Specimen Treatable Thickness
persistent ID: TDO:0000244

MaximumTemperatureSetting
type: Class
subclass of: FurnaceSpecification
subclass of: Restriction
  on property: hasQuantification
  some values from: TemperatureMagnitude
comment: The equipment setting which specifies the maximum achievable temperature by the machine.
definition origin: TriboData Team at IAM-CMS at KIT, Karlsruhe, Germany
friendly name: Maximum Temperature
persistent ID: TDO:0000251

MaximumToolTurningSpeedSetpoint
type: Class
subclass of: CupGrindingMachineSpecification
subclass of: Restriction
  on property: hasQuantification
  some values from: AngularVelocitySetpointMagnitude
comment: Instances of this class characterize the maximum permissable working tool turning speed.
definition origin: TriboData Team at IAM-CMS at KIT, Karlsruhe, Germany
friendly name: Maximum Working Tool Turning Speed
persistent ID: TDO:0000238

MaximumTravelSpeed
type: Class
subclass of: ProfilometerSpecifications
subclass of: Restriction
  on property: hasQuantification
  some values from: SpeedSetpointMagnitude
comment: Instances of this class represent the maximum permissable travel speed, while no measurement is taken.
definition origin: TriboData Team at IAM-CMS at KIT, Karlsruhe, Germany
friendly name: Maximum Travel Speed
persistent ID: TDO:0000263

MaximumTurningSpeedSetpoint
type: Class
subclass of: CupGrindingMachineSpecification
subclass of: Restriction
  on property: hasQuantification
  some values from: AngularVelocitySetpointMagnitude
comment: The maximum permissable turning speed.
definition origin: TriboData Team at IAM-CMS at KIT, Karlsruhe, Germany
friendly name: Maximum Turning Speed
persistent ID: TDO:0000239

MaximumVoltageSetpoint
type: Class
subclass of: TribologicalExperimentSetting
subclass of: Restriction
  on property: hasQuantification
  some values from: VoltageMagnitude
comment: The physical quantity that characterizes the maximum voltage at which the connection is used.
definition origin: TriboData Team at IAM-CMS at KIT, Karlsruhe, Germany
friendly name: Maximum Voltage Setpoint
persistent ID: TDO:0000328

MeasurementDIrection
type: Class
subclass of: SurfaceProfilometrySetting
subclass of: Restriction
  on property: hasCount
  some values from: integer
comment: Instances of this class characterize the measurement direction as defined by the equipment specifications.
definition origin: TriboData Team at IAM-CMS at KIT, Karlsruhe, Germany
friendly name: Measurement Direction
persistent ID: TDO:0000313

MeasurementRange
type: Class
subclass of: ProfilometerSpecifications
subclass of: Restriction
  on property: hasQuantification
  some values from: DistanceMagnitude
comment: Instances of this class represent the maximum range of values that the system can capture in one acquisition process/one measurement. The axis is the only one available by the particular (sub)system.
definition origin: TriboData Team at IAM-CMS at KIT, Karlsruhe, Germany
friendly name: Measurement Range
persistent ID: TDO:0000535

MeasurementResolution
type: Class
subclass of: ProfilometerSpecifications
subclass of: Restriction
  on property: hasQuantification
  some values from: DistanceMagnitude
comment: Instances of this class represent the maximum resolution that the system can capture in one acquisition process/one measurement. The axis is the only one available by the particular sub/system.
definition origin: TriboData Team at IAM-CMS at KIT, Karlsruhe, Germany
friendly name: Measurement Resolution
persistent ID: TDO:0000264

MeasurementSourceCategory
type: Class
subclass of: ClassificationCategory
comment: Instances of this class give the class of source/origin of a measurement.
definition origin: TriboData Team at IAM-CMS at KIT, Karlsruhe, Germany
friendly name: Source Category
persistent ID: TDO:0000141

MercedesBenzStandard
type: Class
subclass of: InterfacialMediumStandard
comment: Class containing information about the technical standard of the interfacial medium.
definition origin: TriboData Team at IAM-CMS at KIT, Karlsruhe, Germany
friendly name: Mercedes-Benz Standard
persistent ID: TDO:0000220

MetalSawingConsumableEnsamble
type: Class
subclass of: ExperimentalConsumablesEnsemble
subclass of: Restriction
  on property: isComprisedOf
  some values from: Coolant
subclass of: Restriction
  on property: isComprisedOf
  some values from: SawingBlade
comment: Class containing a collection of the consumables that participated in a scientific process.
definition origin: TriboData Team at IAM-CMS at KIT, Karlsruhe, Germany
friendly name: Consumables Used
persistent ID: TDO:0000446

MetalSawingProcess
type: Class
subclass of: IndustrialProcess
subclass of: Restriction
  on property: employsEquipment
  some values from: BandSaw
subclass of: Restriction
  on property: hasIdentifier
  some values from: ProcessGeneralIdentifyingInformation
subclass of: Restriction
  on property: isControlledBy
  some values from: MetalSawingConsumableEnsamble
subclass of: Restriction
  on property: isControlledBy
  some values from: MetalSawingProcessInputsArray
subclass of: Restriction
  on property: isControlledBy
  some values from: UncontrolledEnvironmentalConditionsArray
subclass of: Restriction
  on property: makesUseOfConsumable
  some values from: InterfacialMedium
subclass of: Restriction
  on property: physicallyModifies
  some values from: BlockSpecimen
subclass of: Restriction
  on property: physicallyResultsIn
  some values from: BlockSpecimen
comment: Class representing the physical process of separating metal bodies for eventual use in scientific process or equipment.
contextual type: IndustrialProcedureType
definition origin: TriboData Team at IAM-CMS at KIT, Karlsruhe, Germany
friendly name: Metal Sawing
persistent ID: TDO:0000213

MetalSawingProcessInputsArray
type: Class
subclass of: CircumstancesCollective
subclass of: Restriction
  on property: isComprisedOf
  some values from: CuttingPressureSetpoint
subclass of: Restriction
  on property: isComprisedOf
  some values from: CuttingSpeedSetpoint
subclass of: Restriction
  on property: isComprisedOf
  some values from: InterfacialMediumSupplyMethod
comment: Class containing information about the parameters specific to the process.
definition origin: TriboData Team at IAM-CMS at KIT, Karlsruhe, Germany
friendly name: Sawing Process Parameters
persistent ID: TDO:0000405

MetalSawingSpecimensEnsamble
type: Class
subclass of: ExperimentalSpecimensEnsamble
subclass of: Restriction
  on property: isComprisedOf
  some values from: BlockSpecimen
comment: Class containing a collection of the specimens that participated in a scientific process.
definition origin: TriboData Team at IAM-CMS at KIT, Karlsruhe, Germany
friendly name: Samples Sawn
persistent ID: TDO:0000447

MinimumAvailableNorlmalLoad
type: Class
subclass of: EquipmentSpecification
subclass of: Restriction
  on property: hasQuantification
  some values from: ForceSetpointMagnitude
comment: Instances of this class represent the minimum permissable normal load.
definition origin: TriboData Team at IAM-CMS at KIT, Karlsruhe, Germany
friendly name: Minimum Normal Load
persistent ID: TDO:0000257

MinimumDurationSetpoint
type: Class
subclass of: EquipmentSpecification
subclass of: Restriction
  on property: hasQuantification
  some values from: TimeDuration
comment: Instances of this class characterize the minimum permissible duration for a process maintained by a machine.
definition origin: TriboData Team at IAM-CMS at KIT, Karlsruhe, Germany
friendly name: Minimum Duration
persistent ID: TDO:0000258

MinimumIntensityThreshold
type: Class
subclass of: SurfaceProfilometrySetting
subclass of: Restriction
  on property: hasCount
  some values from: float
comment: Instances of this class determine whether a recorded signal value is considered valid or not.
definition origin: TriboData Team at IAM-CMS at KIT, Karlsruhe, Germany
friendly name: Minimum Intensity Threshold
persistent ID: TDO:0000314

MinimumMeasurementSpeed
type: Class
subclass of: ProfilometerSpecifications
subclass of: Restriction
  on property: hasQuantification
  some values from: SpeedSetpointMagnitude
comment: Instances of this class represent the minimum permissable measument speed.
definition origin: TriboData Team at IAM-CMS at KIT, Karlsruhe, Germany
friendly name: Minimum Measurement Speed
persistent ID: TDO:0000534

MinimumPositioningSystemTurningSpeedSetpoint
type: Class
subclass of: CupGrindingProcessSetting
subclass of: Restriction
  on property: hasQuantification
  some values from: AngularVelocitySetpointMagnitude
comment: Instances of this class characterize the minimum permissable turning speed.
definition origin: TriboData Team at IAM-CMS at KIT, Karlsruhe, Germany
friendly name: Minimum Positioning System Turning Speed
persistent ID: TDO:0000292

MinimumToolTurningSpeedSetpoint
type: Class
subclass of: CupGrindingMachineSpecification
subclass of: Restriction
  on property: hasQuantification
  some values from: AngularVelocitySetpointMagnitude
comment: Instances of this class characterize the minimum permissable working tool turning speed.
definition origin: TriboData Team at IAM-CMS at KIT, Karlsruhe, Germany
friendly name: Minimum Working Tool Turning Speed
persistent ID: TDO:0000240

MinimumTravelSpeed
type: Class
subclass of: ProfilometerSpecifications
subclass of: Restriction
  on property: hasQuantification
  some values from: SpeedSetpointMagnitude
comment: Instances of this class represent the minimum permissable travel speed, while no measurement is taken.
definition origin: TriboData Team at IAM-CMS at KIT, Karlsruhe, Germany
friendly name: Minimum Travel Speed
persistent ID: TDO:0000265

MinimumTurningSpeedSetpoint
type: Class
subclass of: CupGrindingMachineSpecification
subclass of: Restriction
  on property: hasQuantification
  some values from: AngularVelocitySetpointMagnitude
comment: The minimum permissable turning speed.
definition origin: TriboData Team at IAM-CMS at KIT, Karlsruhe, Germany
friendly name: Minimum Turning Speed
persistent ID: TDO:0000241

MinimumVoltageSetpoint
type: Class
subclass of: TribologicalExperimentSetting
subclass of: Restriction
  on property: hasQuantification
  some values from: VoltageMagnitude
comment: The physical quantity that characterizes the minimum voltage at which the connection is used.
definition origin: TriboData Team at IAM-CMS at KIT, Karlsruhe, Germany
friendly name: Minimum Voltage Setpoint
persistent ID: TDO:0000329

MotionDeliveryMethod
type: Class
subclass of: DeliveryMethod
comment: Field that holds information about the working principle of a subsystem.
definition origin: TriboData Team at IAM-CMS at KIT, Karlsruhe, Germany
friendly name: Principle of Motion Delivery
persistent ID: TDO:0000195

MotionSpeedSetpoint
type: Class
subclass of: DemagnetizationProcessSetting
subclass of: Restriction
  on property: hasQuantification
  some values from: SpeedSetpointMagnitude
comment: Instances of this class characterize the relative motion of an object. For Demagnetizing: The (estimated) speed of the demagnetizing motion. Sometimes is given as seconds per demagnetizing motion.
definition origin: TriboData Team at IAM-CMS at KIT, Karlsruhe, Germany
friendly name: Motion Speed Setpoint
persistent ID: TDO:0000305

MotionStartingDirectionSetpoint
type: Class
subclass of: TribologicalExperimentSetting
comment: The intial direction of motion when the relative motion sets in.
definition origin: TriboData Team at IAM-CMS at KIT, Karlsruhe, Germany
friendly name: Starting Direction
persistent ID: TDO:0000330

Name
type: Class
subclass of: Attribute
comment: A name a word or phrase constituting the individual designation by which a particular person or thing is known, referred to, or addressed. Reference: The Oxford English Dictionary. Oxford University Press, 2 Ed., 1989
definition origin: EXPO Ontology (http://expo.sourceforge.net)

NormalLoadSetpoint
type: Class
subclass of: TribologicalExperimentSetting
subclass of: Restriction
  on property: hasQuantification
  some values from: ForceSetpointMagnitude
comment: The prescribed normal load set at the beginning of a process.
definition origin: TriboData Team at IAM-CMS at KIT, Karlsruhe, Germany
friendly name: Normal Load Setpoint
persistent ID: TDO:0000331

Number
type: Class
subclass of: Quantity
comment: A measure of how many things there are, or how much there is, of a certain kind. Numbers are subclassed into RealNumber, ComplexNumber, and ImaginaryNumber.
definition origin: SUMO Ontology (http://www.adampease.org/OP)

NumberOfFiles
type: Class
subclass of: Number
subclass of: Restriction
  on property: hasCount
  some values from: integer
comment: Number of files used or generated by a process. For example, some tribometers output a number of similar files such as file_0001.xyz ... file_0999.xyz in the case of 999 files (e.g. one file used per trace / cycle in an experiment). It does not make sense to add each individual file to the array of file info but just add one instance of 005 File info to the array of file infos. If only one file is used, this is 1.
definition origin: TriboData Team at IAM-CMS at KIT, Karlsruhe, Germany
friendly name: Number of Files
persistent ID: TDO:0000357

NumberOfProcedureRepeats
type: Class
subclass of: DemagnetizationProcessSetting
subclass of: Number
subclass of: Restriction
  on property: hasCount
  some values from: integer
comment: Instances of this class represent the total number of measurements for one sample.
definition origin: TriboData Team at IAM-CMS at KIT, Karlsruhe, Germany
friendly name: Number of Collected Profiles
persistent ID: TDO:0000306

NumberOfScannedProfiles
type: Class
subclass of: Number
subclass of: Restriction
  on property: hasCount
  some values from: integer
comment: Instances of this class represent the total number of measurements for one sample.
definition origin: TriboData Team at IAM-CMS at KIT, Karlsruhe, Germany
friendly name: Number of Collected Profiles
persistent ID: TDO:0000358

NumberOfValueSetsInFile
type: Class
subclass of: Number
subclass of: Restriction
  on property: hasCount
  some values from: integer
comment: Instances of this class provide information on how many individual value sets a file contains (= number of individual time series or number of recorded channels).
definition origin: TriboData Team at IAM-CMS at KIT, Karlsruhe, Germany
friendly name: Number of Individual Value Sets in File
persistent ID: TDO:0000359

ObjectDiameter
type: Class
subclass of: ObjectSpecification
subclass of: Restriction
  on property: hasQuantification
  some values from: DistanceMagnitude
comment: The specification of a preferencially curved object defining its diameter.
definition origin: TriboData Team at IAM-CMS at KIT, Karlsruhe, Germany
friendly name: Diameter
persistent ID: TDO:0000340

ObjectFlashPoint
type: Class
subclass of: ObjectSpecification
subclass of: Restriction
  on property: hasQuantification
  some values from: TemperatureMagnitude
comment: Object's Flash Point.
definition origin: TriboData Team at IAM-CMS at KIT, Karlsruhe, Germany
friendly name: Flash Point
persistent ID: TDO:0000341

ObjectGritSize
type: Class
subclass of: ObjectSpecification
subclass of: Restriction
  on property: hasQuantification
  some values from: DistanceMagnitude
comment: The physical characteristic called grit size.
definition origin: TriboData Team at IAM-CMS at KIT, Karlsruhe, Germany
friendly name: Grit Size
persistent ID: TDO:0000342

ObjectHeight
type: Class
subclass of: ObjectSpecification
subclass of: Restriction
  on property: hasQuantification
  some values from: DistanceMagnitude
comment: The specification of an object defining its height.
comment: i.e. the dimension that will measure the object's size in its natural and most common orientation, parallel to the gravity vector.
definition origin: TriboData Team at IAM-CMS at KIT, Karlsruhe, Germany
friendly name: Height
persistent ID: TDO:0000343

ObjectKinematicViscosity
type: Class
subclass of: ObjectSpecification
subclass of: Restriction
  on property: hasQuantification
  some values from: KinematicViscosityMagnitude
comment: The specification of an object defining its kinematic viscosity.
definition origin: TriboData Team at IAM-CMS at KIT, Karlsruhe, Germany
friendly name: Kinematic Viscosity
persistent ID: TDO:0000344

ObjectKinematicViscosityAcquisitionTemperature
type: Class
subclass of: ObjectSpecification
subclass of: Restriction
  on property: hasQuantification
  some values from: TemperatureMagnitude
comment: The specification of an object defining its kinematic viscosity acquisition temperature.
definition origin: TriboData Team at IAM-CMS at KIT, Karlsruhe, Germany
friendly name: Kinematic Viscosity Acquisition Temperature
persistent ID: TDO:0000345

ObjectLength
type: Class
subclass of: ObjectSpecification
subclass of: Restriction
  on property: hasQuantification
  some values from: DistanceMagnitude
comment: The specification of an object defining its length.
comment: i.e. Longest Dimension
definition origin: TriboData Team at IAM-CMS at KIT, Karlsruhe, Germany
friendly name: Length
persistent ID: TDO:0000346

ObjectMass
type: Class
subclass of: ObjectSpecification
subclass of: Restriction
  on property: hasQuantification
  some values from: ObjectMassMagnitude
comment: The specification of an object defining its mass.
definition origin: TriboData Team at IAM-CMS at KIT, Karlsruhe, Germany
friendly name: Mass
persistent ID: TDO:0000347

ObjectMassDensity
type: Class
subclass of: ObjectSpecification
subclass of: Restriction
  on property: hasQuantification
  some values from: MassDensityMagnitude
comment: The specification of an object defining its mass density.
definition origin: TriboData Team at IAM-CMS at KIT, Karlsruhe, Germany
friendly name: Mass Density
persistent ID: TDO:0000348

ObjectMassDensityAcquisitionTemperature
type: Class
subclass of: ObjectSpecification
subclass of: Restriction
  on property: hasQuantification
  some values from: TemperatureMagnitude
comment: The specification of an object defining its mass density acquisition temperature.
definition origin: TriboData Team at IAM-CMS at KIT, Karlsruhe, Germany
friendly name: Mass Density Acquisition Temperature
persistent ID: TDO:0000349

ObjectMassMagnitude
type: Class
subclass of: PhysicalQuantity
subclass of: Restriction
  on property: hasPhysicalUnit
  some values from: MassUnit
subclass of: Restriction
  on property: hasRationalNumberValue
  some values from: float
comment: The physical quantity that characterizes the phenomenon called Mass.
definition origin: TriboData Team at IAM-CMS at KIT, Karlsruhe, Germany
friendly name: Mass Magnitude
persistent ID: TDO:0000370

ObjectModelName
type: Class
subclass of: EquipmentRelatedName
comment: The model name of equipment/object, which the company has given to its product.
definition origin: TriboData Team at IAM-CMS at KIT, Karlsruhe, Germany
friendly name: Equipment/Product Model
persistent ID: TDO:0000156

ObjectPourPoint
type: Class
subclass of: ObjectSpecification
subclass of: Restriction
  on property: hasQuantification
  some values from: TemperatureMagnitude
comment: Object's Pour Point.
definition origin: TriboData Team at IAM-CMS at KIT, Karlsruhe, Germany
friendly name: Pour Point
persistent ID: TDO:0000350

ObjectRadius
type: Class
subclass of: ObjectSpecification
subclass of: Restriction
  on property: hasQuantification
  some values from: DistanceMagnitude
comment: The specification of a preferencially curved object defining its radius.
definition origin: TriboData Team at IAM-CMS at KIT, Karlsruhe, Germany
friendly name: Radius
persistent ID: TDO:0000351

ObjectThickness
type: Class
subclass of: ObjectSpecification
subclass of: Restriction
  on property: hasQuantification
  some values from: DistanceMagnitude
comment: The specification of an object defining its thickness.
comment: i.e. Smallest Dimension
definition origin: TriboData Team at IAM-CMS at KIT, Karlsruhe, Germany
friendly name: Thickness
persistent ID: TDO:0000352

ObjectWidth
type: Class
subclass of: ObjectSpecification
subclass of: Restriction
  on property: hasQuantification
  some values from: DistanceMagnitude
comment: The specification of an object defining its width.
comment: i.e. Second Longest Dimension
definition origin: TriboData Team at IAM-CMS at KIT, Karlsruhe, Germany
friendly name: Width
persistent ID: TDO:0000353

OperatingSystemName
type: Class
subclass of: EquipmentRelatedName
comment: Name of computer operating system.
definition origin: TriboData Team at IAM-CMS at KIT, Karlsruhe, Germany
friendly name: Operating System Name
persistent ID: TDO:0000157

OperatorPersonalInformation
type: Class
subclass of: IdentificatoryCollective
subclass of: Restriction
  on property: isComprisedOf
  some values from: FirstNames
subclass of: Restriction
  on property: isComprisedOf
  some values from: LastName
subclass of: Restriction
  on property: isComprisedOf
  some values from: ProfessionalCapacity
subclass of: Restriction
  on property: isComprisedOf
  some values from: ResearchInstitutionName
subclass of: Restriction
  on property: isComprisedOf
  some values from: UserToken
comment: Class containing information about who performed a scientific process, or is responsible for an object.
definition origin: TriboData Team at IAM-CMS at KIT, Karlsruhe, Germany
friendly name: Operator/s in Charge
persistent ID: TDO:0000441

OpticalSurfaceProfilometer
type: Class
subclass of: PoweredMachine
subclass of: Restriction
  on property: hasIdentifier
  some values from: EquipmentGeneralIdentifyingInformation
subclass of: Restriction
  on property: hasTechnicalSpecification
  some values from: OpticalSurfaceProfilometerSpecificationsArray
comment: Objects of this class pertain to the category of machines called optical surface profilometer.
contextual type: LabEquipmentType
definition origin: TriboData Team at IAM-CMS at KIT, Karlsruhe, Germany
friendly name: Optical Surface Profilometer
persistent ID: TDO:0000522

OpticalSurfaceProfilometerSpecificationsArray
type: Class
subclass of: OpticalSurfaceProfilometerRelatedCollective
subclass of: Restriction
  on property: isComprisedOf
  some values from: SensorInfoArray
subclass of: Restriction
  on property: isComprisedOf
  some values from: XMeasurementRange
subclass of: Restriction
  on property: isComprisedOf
  some values from: XMeasurementResolution
subclass of: Restriction
  on property: isComprisedOf
  some values from: XTravelRange
subclass of: Restriction
  on property: isComprisedOf
  some values from: YMeasurementRange
subclass of: Restriction
  on property: isComprisedOf
  some values from: YMeasurementResolution
subclass of: Restriction
  on property: isComprisedOf
  some values from: YTravelRange
subclass of: Restriction
  on property: isComprisedOf
  some values from: ZMaximumMeasurementSpeed
subclass of: Restriction
  on property: isComprisedOf
  some values from: ZMeasurementRange
subclass of: Restriction
  on property: isComprisedOf
  some values from: ZMeasurementResolution
subclass of: Restriction
  on property: isComprisedOf
  some values from: ZMinimumMeasurementSpeed
subclass of: Restriction
  on property: isComprisedOf
  some values from: ZTravelRange
comment: Class containing information about the technical specifications of a optical surface profilometer.
definition origin: TriboData Team at IAM-CMS at KIT, Karlsruhe, Germany
friendly name: Technical Specifications
persistent ID: TDO:0000488

OpticalSurfaceProfilometry
type: Class
subclass of: DescriptiveProcess
subclass of: Restriction
  on property: characterizesSpecimen
  some values from: BlockSpecimen
subclass of: Restriction
  on property: employsEquipment
  some values from: OpticalSurfaceProfilometer
subclass of: Restriction
  on property: generatesFile
  some values from: File
subclass of: Restriction
  on property: hasFilesWithMetadata
  some values from: ExperimentOutputFileMetadataArray
subclass of: Restriction
  on property: hasIdentifier
  some values from: ProcessGeneralIdentifyingInformation
subclass of: Restriction
  on property: isControlledBy
  some values from: OpticalSurfaceProfilometryInputsArray
subclass of: Restriction
  on property: isControlledBy
  some values from: UncontrolledEnvironmentalConditionsArray
comment: Class representing the monitored processes that produce a (set of) file(s) whose contents could be used for visualization.
contextual type: ScientificProcedureType
definition origin: TriboData Team at IAM-CMS at KIT, Karlsruhe, Germany
friendly name: Optical Surface Profilometry
persistent ID: TDO:0000532

OpticalSurfaceProfilometryInputsArray
type: Class
subclass of: CircumstancesCollective
subclass of: Restriction
  on property: hasQuantification
  some values from: XNumberOfPoints
subclass of: Restriction
  on property: hasQuantification
  some values from: YNumberOfPoints
subclass of: Restriction
  on property: isComprisedOf
  some values from: DarkCorrectionPerformance
subclass of: Restriction
  on property: isComprisedOf
  some values from: MeasurementDIrection
subclass of: Restriction
  on property: isComprisedOf
  some values from: MinimumIntensityThreshold
subclass of: Restriction
  on property: isComprisedOf
  some values from: SamplingRateSetpoint
subclass of: Restriction
  on property: isComprisedOf
  some values from: XMeasurementOffset
subclass of: Restriction
  on property: isComprisedOf
  some values from: XMeasurementRange
subclass of: Restriction
  on property: isComprisedOf
  some values from: YMeasurementOffset
subclass of: Restriction
  on property: isComprisedOf
  some values from: YMeasurementRange
comment: Class containing information about the parameters that are put into the involved scientific equipment to run it optimally.
definition origin: TriboData Team at IAM-CMS at KIT, Karlsruhe, Germany
friendly name: System/Setup Inputs
persistent ID: TDO:0000406

ParcelDeliveryReceiptTime
type: Class
subclass of: TimePoint
subclass of: Restriction
  on property: hasTimeStamp
  qualified cardinality: 1
  on data range: dateTimeStamp
comment: Instances of this class identify when a delivery was left at the research institution. Please note: In the Kadi4Mat the data type for this is Date — dd. "Month" yyyy HH:MM:SS.
definition origin: TriboData Team at IAM-CMS at KIT, Karlsruhe, Germany
friendly name: Time at Receipt of Delivery
persistent ID: TDO:0000386

Physical
type: Class
subclass of: Entity
definition origin: SUMO Ontology (http://www.adampease.org/OP)

PhysicalObject
type: Class
subclass of: Physical
comment: Corresponds roughly to the class of ordinary objects. Examples include normal physical objects, geographical regions, and locations of Processes, the complement of Objects in the Physical class. In a 4D ontology, an Object is something whose spatiotemporal extent is thought of as dividing into spatial parts roughly parallel to the time-axis."http://www.ontologyportal.org/
definition origin: SUMO Ontology (http://www.adampease.org/OP)

PhysicalQuantity
type: Class
subclass of: Quantity
comment: A PhysicalQuantity is a measure of some quantifiable aspect of the modeled world, such as 'the earth's diameter' (a constant length) and 'the stress in a loaded deformable solid' (a measure of stress, which is a function of three spatial coordinates). All PhysicalQuantities are either ConstantQuantities or FunctionQuantities. Instances of ConstantQuantity are dependent on a UnitOfMeasure, while instances of FunctionQuantity are Functions that map instances of ConstantQuantity to other instances of ConstantQuantity (e.g., TimeDependentQuantities are FunctionQuantities). Although the name and definition of PhysicalQuantity is borrowed from physics, PhysicalQuantities need not be material. Aside from the dimensions of length, time, velocity, etc., nonphysical dimensions such as currency are also possible. Accordingly, amounts of money would be instances of PhysicalQuantity. PhysicalQuantities are distinguished from Numbers by the fact that the former are associated with a dimension of measurement.
definition origin: SUMO Ontology (http://www.adampease.org/OP)

PhysicalQuantityUnit
type: Class
subclass of: Attribute
comment: Instances of this class lock the meaning of a magnitude.
definition origin: TriboData Team at IAM-CMS at KIT, Karlsruhe, Germany
friendly name: Unit of Measure
persistent ID: TDO:0000183

PoleSurfaceLength
type: Class
subclass of: DemagnetizingPlateSpecification
subclass of: Restriction
  on property: hasQuantification
  some values from: DistanceMagnitude
comment: Instances of this class specify the pole surface size. *Length is longer than Width.
definition origin: TriboData Team at IAM-CMS at KIT, Karlsruhe, Germany
friendly name: Pole Surface Length
persistent ID: TDO:0000245

PoleSurfaceWidth
type: Class
subclass of: DemagnetizingPlateSpecification
subclass of: Restriction
  on property: hasQuantification
  some values from: DistanceMagnitude
comment: Instances of this class specify the pole surface size. *Length is longer than Width.
definition origin: TriboData Team at IAM-CMS at KIT, Karlsruhe, Germany
friendly name: Pole Surface Width
persistent ID: TDO:0000246

PositionalRepeatability
type: Class
subclass of: ProfilometerSpecifications
subclass of: Restriction
  on property: hasQuantification
  some values from: DistanceMagnitude
comment: Instances of this class represent the maximum deviation from a prescribed position.
definition origin: TriboData Team at IAM-CMS at KIT, Karlsruhe, Germany
friendly name: Positional Repeatability
persistent ID: TDO:0000266

PositioningSystemTurningSpeedSetpoint
type: Class
subclass of: CupGrindingProcessSetting
subclass of: Restriction
  on property: hasQuantification
  some values from: AngularVelocitySetpointMagnitude
comment: Instances of this class characterize the set turning speed.
definition origin: TriboData Team at IAM-CMS at KIT, Karlsruhe, Germany
friendly name: Positioning System Turning Speed
persistent ID: TDO:0000293

PowerConsumption
type: Class
subclass of: EquipmentSpecification
subclass of: Restriction
  on property: hasQuantification
  some values from: WattageMagnitude
comment: Instances of this class characterize the power consumption of a laboratory equipment.
definition origin: TriboData Team at IAM-CMS at KIT, Karlsruhe, Germany
friendly name: Power Consumption
persistent ID: TDO:0000259

PowerSupplyVoltage
type: Class
subclass of: EquipmentSpecification
subclass of: Restriction
  on property: hasQuantification
  some values from: VoltageMagnitude
comment: The physical quantity that characterizes the operating voltage at which the power supply is used.
definition origin: TriboData Team at IAM-CMS at KIT, Karlsruhe, Germany
friendly name: Power Supply Voltage
persistent ID: TDO:0000260

PowerSupplyWattage
type: Class
subclass of: EquipmentSpecification
subclass of: Restriction
  on property: hasQuantification
  some values from: WattageMagnitude
comment: The physical quantity that characterizes the power conversion capability of a power supply
definition origin: TriboData Team at IAM-CMS at KIT, Karlsruhe, Germany
friendly name: Power Supply Wattage
persistent ID: TDO:0000261

PowerUnit
type: Class
subclass of: ConversionTargetUnit
subclass of: PhysicalQuantityUnit
comment: The unit that locks the meaning of the magnitude of the phenomenon of power.
definition origin: TriboData Team at IAM-CMS at KIT, Karlsruhe, Germany
friendly name: Power Unit
persistent ID: TDO:0000117

Predicate
type: Class
subclass of: Relation
comment: A Predicate is a sentence-forming Relation. Each tuple in the Relation is a finite, ordered sequence of objects. The fact that a particular tuple is an element of a Predicate is denoted by '(*predicate* arg_1 arg_2 .. arg_n)', where the arg_i are the objects so related. In the case of BinaryPredicates, the fact can be read as `arg_1 is *predicate* arg_2' or `a *predicate* of arg_1 is arg_2'.
definition origin: SUMO Ontology (http://www.adampease.org/OP)

PrescribedTypeOfTribologicalContact
type: Class
subclass of: ModelAssumption
comment: The (intial) type of contact used in a tribological experiment.
definition origin: TriboData Team at IAM-CMS at KIT, Karlsruhe, Germany
friendly name: Contact Type
persistent ID: TDO:0000205

PressureSetpointMagnitude
type: Class
subclass of: SetpointQuantity
subclass of: Restriction
  on property: hasPhysicalUnit
  some values from: PressureUnit
subclass of: Restriction
  on property: hasRationalNumberValue
  some values from: float
comment: The physical quantity that characterizes the phenomenon called pressure.
definition origin: TriboData Team at IAM-CMS at KIT, Karlsruhe, Germany
friendly name: Pressure Setpoint Magnitude
persistent ID: TDO:0000377

PressureUnit
type: Class
subclass of: ConversionTargetUnit
subclass of: PhysicalQuantityUnit
comment: The unit that locks the meaning of the amount of the phenomenon called pressure.
definition origin: TriboData Team at IAM-CMS at KIT, Karlsruhe, Germany
friendly name: Pressure Unit
persistent ID: TDO:0000118

ProbeArmMountingMethod
type: Class
subclass of: ClampingMethod
comment: Instances of this class characterize the method of clamping of a probe arm.
definition origin: TriboData Team at IAM-CMS at KIT, Karlsruhe, Germany
friendly name: Probe Arm Mounting Method
persistent ID: TDO:0000187

Procedure
type: Class
subclass of: Proposition
comment: A sequence-dependent specification. Some examples are ComputerPrograms, finite-state machines, cooking recipes, musical scores, conference schedules, driving directions, and the scripts of plays and movies.
definition origin: SUMO Ontology (http://www.adampease.org/OP)

ProcessGeneralIdentifyingInformation
type: Class
subclass of: IdentificatoryCollective
subclass of: Restriction
  on property: isComprisedOf
  some values from: LocationInformation
subclass of: Restriction
  on property: isComprisedOf
  some values from: OperatorPersonalInformation
subclass of: Restriction
  on property: isComprisedOf
  some values from: ProcessStartTime
comment: Objects of this class contain information that unequivocally identifies the process.
definition origin: TriboData Team at IAM-CMS at KIT, Karlsruhe, Germany
friendly name: General Info
persistent ID: TDO:0000442

ProcessStartTime
type: Class
subclass of: TimePoint
subclass of: Restriction
  on property: hasTimeStamp
  qualified cardinality: 1
  on data range: dateTimeStamp
comment: Subsection holds information about when the experiment was conducted. Please note: In the Kadi4Mat the data type for this is Date.
definition origin: TriboData Team at IAM-CMS at KIT, Karlsruhe, Germany
friendly name: Timestamp
persistent ID: TDO:0000387

ProfessionalCapacity
type: Class
subclass of: OperatorPersonalIdentifiers
comment: Information about a user's role inside an institution's structure.
definition origin: TriboData Team at IAM-CMS at KIT, Karlsruhe, Germany
friendly name: User Role
persistent ID: TDO:0000170

Proposition
type: Class
subclass of: Abstract
comment: Propositions are Abstract entities that express a complete thought or a set of such thoughts. As an example, the formula ' (instance Yojo Cat)' expresses the Proposition that the entity named Yojo is an element of the Class of Cats. Note that propositions are not restricted to the content expressed by individual sentences of a Language. They may encompass the content expressed by theories, books, and even whole libraries. It is important to distinguish Propositions from the ContentBearingObjects that express them. A Proposition is a piece of information, e.g. that the cat is on the mat, but a ContentBearingObject is an Object that represents this information. A Proposition is an abstraction that may have multiple representations: strings, sounds, icons, etc. For example, the Proposition that the cat is on the mat is represented here as a string of graphical characters displayed on a monitor and/or printed on paper, but it can be represented by a sequence of sounds or by some non-latin alphabet or by some cryptographic form.
definition origin: SUMO Ontology (http://www.adampease.org/OP)

Quantity
type: Class
subclass of: Abstract
comment: Any specification of how many or how much of something there is. Accordingly, there are two subclasses of Quantity: Number (how many) and PhysicalQuantity (how much).
definition origin: SUMO Ontology (http://www.adampease.org/OP)

QuantityAbbreviation
type: Class
subclass of: Name
subclass of: Restriction
  on property: hasText
  some values from: string
comment: The agreed on abbreviation (= short common name) of the variable the time series captured. Refers to common names of information/quantities/elements/entities captured during experiments.
definition origin: TriboData Team at IAM-CMS at KIT, Karlsruhe, Germany
friendly name: Abbreviation
persistent ID: TDO:0000173

QuantityFriendlyName
type: Class
subclass of: Name
subclass of: Restriction
  on property: hasText
  some values from: string
comment: The user friendly (= long common) name of the variable the time series captured. Refers to common names of information/quantities/elements/entities we capture during experiments.
definition origin: TriboData Team at IAM-CMS at KIT, Karlsruhe, Germany
friendly name: Friendly Name
persistent ID: TDO:0000174

RadialPositionSetpoint
type: Class
subclass of: TribologicalExperimentSetting
subclass of: Restriction
  on property: hasQuantification
  some values from: DistanceSetpointMagnitude
comment: Instances of this class characterize the contact position with respect to the center of a disc in a pin-on-disc tribological experiment.
definition origin: TriboData Team at IAM-CMS at KIT, Karlsruhe, Germany
friendly name: Radial Position on Disc
persistent ID: TDO:0000332

RectangularTubeMaximumHeight
type: Class
subclass of: BandSawSpecification
subclass of: Restriction
  on property: hasQuantification
  some values from: DistanceMagnitude
comment: The maximum permissable rectangular tube cross-sectional height. Shorter than Width dimension.
definition origin: TriboData Team at IAM-CMS at KIT, Karlsruhe, Germany
friendly name: Rectangular Tube Maximum Height
persistent ID: TDO:0000226

RectangularTubeMaximumWidth
type: Class
subclass of: BandSawSpecification
subclass of: Restriction
  on property: hasQuantification
  some values from: DistanceMagnitude
comment: The maximum permissable rectangular tube cross-sectional width. Longer than Height dimension.
definition origin: TriboData Team at IAM-CMS at KIT, Karlsruhe, Germany
friendly name: Rectangular Tube Maximum Width
persistent ID: TDO:0000227

Relation
type: Class
subclass of: Abstract
comment: The Class of relations. There are three kinds of Relation: Predicate, Function, and List. Predicates and Functions both denote sets of ordered n-tuples. The difference between these two Classes is that Predicates cover formula-forming operators, while Functions cover term-forming operators. A List, on the other hand, is a particular ordered n-tuple.
definition origin: SUMO Ontology (http://www.adampease.org/OP)

RelativeHumidityMagnitude
type: Class
subclass of: PhysicalQuantity
subclass of: Restriction
  on property: hasPhysicalUnit
  some values from: RelativeHumidityUnit
subclass of: Restriction
  on property: hasRationalNumberValue
  some values from: float
comment: The physical quantity that characterizes the phenomenon called relative humidity.
definition origin: TriboData Team at IAM-CMS at KIT, Karlsruhe, Germany
friendly name: Environment Relative Humidity Magnitude
persistent ID: TDO:0000371

RelativeHumidityUnit
type: Class
subclass of: ConversionTargetUnit
subclass of: PhysicalQuantityUnit
comment: The unit that locks the meaning of the amount of the phenomenon of relative humidity.
definition origin: TriboData Team at IAM-CMS at KIT, Karlsruhe, Germany
friendly name: Relative Humidity Unit
persistent ID: TDO:0000119

Representation
type: Class
subclass of: ContentBearingObject
definition origin: SUMO Ontology (http://www.adampease.org/OP)

ResearchInstitutionName
type: Class
subclass of: OrganizationName
comment: The official name of the institution which the responsible person/operator belongs to.
definition origin: TriboData Team at IAM-CMS at KIT, Karlsruhe, Germany
friendly name: Institution Name
persistent ID: TDO:0000172

Role
type: Class
subclass of: Predicate
comment: (role ?OBJECT ?ENTITY) means that ?OBJECT - a Role holder, plays a Role ?ENTITY in some context. In EXPO we always consider the context: experiment. For example in context of experiment an object <human> can play the role <subject of experiment> if the human is "one who executes the experiment" (OED) or the role if the human is one "on whom an experiment is made." (OED).
definition origin: SUMO Ontology (http://www.adampease.org/OP)

Room
type: Class
subclass of: Location
comment: The "unique identifier" of the room in which a process occurs or an object resides.
definition origin: TriboData Team at IAM-CMS at KIT, Karlsruhe, Germany
friendly name: Room Number
persistent ID: TDO:0000530

RoundTubeMaximumDiameter
type: Class
subclass of: BandSawSpecification
subclass of: Restriction
  on property: hasQuantification
  some values from: DistanceMagnitude
comment: The maximum permissable round tube diameter.
definition origin: TriboData Team at IAM-CMS at KIT, Karlsruhe, Germany
friendly name: Round Tube Maximum Diameter
persistent ID: TDO:0000228

SAEStandard
type: Class
subclass of: InterfacialMediumStandard
comment: Class containing information about the technical standard of the interfacial medium.
definition origin: TriboData Team at IAM-CMS at KIT, Karlsruhe, Germany
friendly name: SAE Standard
persistent ID: TDO:0000221

SamplingRateSetpoint
type: Class
subclass of: TribologicalExperimentSetting
subclass of: Restriction
  on property: hasQuantification
  some values from: FrequencyMagnitude
comment: The actual sample rate of the time series. Please note that this might not be the same as the sample rate setpoint used when conducting the experiment.
definition origin: TriboData Team at IAM-CMS at KIT, Karlsruhe, Germany
friendly name: Actual Sampling Rate
persistent ID: TDO:0000333

SawingBlade
type: Class
subclass of: ManualTool
comment: The type of blade used for sawing.
definition origin: TriboData Team at IAM-CMS at KIT, Karlsruhe, Germany
friendly name: Sawing Blade Type
persistent ID: TDO:0000516

ScientificExperiment
type: Class
subclass of: Procedure
comment: A scientific experiment is a research method which permits the investigation of cause-effect relations between known and unknown (target) variables of the field of study (domain). An experimental result cannot be known with certainty in advance.
comment: The processes that have as a purpose analyzable outcomes.
definition origin: EXPO Ontology (http://expo.sourceforge.net)

Axiom
annotated source: ScientificExperiment
annotated property: comment
annotated target: The processes that have as a purpose analyzable outcomes.
definition origin: TriboData Team at IAM-CMS at KIT, Karlsruhe, Germany

SensorAttributesListItemArray
type: Class
subclass of: OpticalSurfaceProfilometerRelatedCollective
subclass of: TribometerRelatedCollective
subclass of: Restriction
  on property: isComprisedOf
  some values from: ConditionerAttributesArray
subclass of: Restriction
  on property: isComprisedOf
  some values from: EquipmentRole
subclass of: Restriction
  on property: isComprisedOf
  some values from: ManufacturerName
subclass of: Restriction
  on property: isComprisedOf
  some values from: ObjectModelName
subclass of: Restriction
  on property: isComprisedOf
  some values from: SensoringMethod
comment: Class containing attributes about the installed sensors responsible for monitoring a physical quantity in a tribometer or any other lab equipment.
definition origin: TriboData Team at IAM-CMS at KIT, Karlsruhe, Germany
friendly name: List Item (Sensor Attributes)
persistent ID: TDO:0000506

SensorInfoArray
type: Class
subclass of: OpticalSurfaceProfilometerRelatedCollective
subclass of: TribometerRelatedCollective
subclass of: Restriction
  on property: isComprisedOf
  some values from: SensorAttributesListItemArray
comment: Class containing information about all the installed sensors detecting physical quantities during the course of an experiment. These can be force sensors, distance sensors, acoustic transducers etc.
definition origin: TriboData Team at IAM-CMS at KIT, Karlsruhe, Germany
friendly name: Array of Info on Sensors
persistent ID: TDO:0000507

SensoringMethod
type: Class
subclass of: MeasuringMethod
comment: The principle by which a sensor operates.
definition origin: TriboData Team at IAM-CMS at KIT, Karlsruhe, Germany
friendly name: Measurement Principle
persistent ID: TDO:0000204

SequentialOrderPosition
type: Class
subclass of: ExperimentalSetting
subclass of: Restriction
  on property: hasQuantification
  some values from: SequentialOrderPositionNumber
comment: The physical quantity that places an object in a specific position within a sequential order.
definition origin: TriboData Team at IAM-CMS at KIT, Karlsruhe, Germany
friendly name: Sequential Order Position
persistent ID: TDO:0000311

SequentialOrderPositionNumber
type: Class
equivalent class: Class
  intersection of: Number
  intersection of: Restriction
    on property: hasRationalNumberValue
    some values from: integer
comment: The physical quantity that places an object in a specific position within a sequential order.
definition origin: TriboData Team at IAM-CMS at KIT, Karlsruhe, Germany
friendly name: Sequential Order Position Number
persistent ID: TDO:0000360

SlidingRuntimeSetpoint
type: Class
subclass of: TribologicalExperimentSetting
subclass of: Restriction
  on property: hasQuantification
  some values from: TimeDuration
comment: The duration setting assigned to be maintained by the machine in a tribological process.
definition origin: TriboData Team at IAM-CMS at KIT, Karlsruhe, Germany
friendly name: Runtime Setpoint
persistent ID: TDO:0000334

SlidingSpeedSetpoint
type: Class
subclass of: TribologicalExperimentSetting
subclass of: Restriction
  on property: hasQuantification
  some values from: SpeedSetpointMagnitude
comment: The speed setting assigned to be maintained by the machine in a scientific process.
definition origin: TriboData Team at IAM-CMS at KIT, Karlsruhe, Germany
friendly name: Speed Setpoint
persistent ID: TDO:0000335

SoftwareName
type: Class
subclass of: EquipmentRelatedName
comment: The official name of the software under which it's distributed.
definition origin: TriboData Team at IAM-CMS at KIT, Karlsruhe, Germany
friendly name: Software Name
persistent ID: TDO:0000159

SoftwareUsedArray
type: Class
subclass of: SpecificationsCollective
subclass of: Restriction
  on property: isComprisedOf
  some values from: SoftwareUsedArrayItem
comment: Class containing information about the software used to process the data after its initial collection and recording.
definition origin: TriboData Team at IAM-CMS at KIT, Karlsruhe, Germany
friendly name: Array of Software Used
persistent ID: TDO:0000489

SoftwareUsedArrayItem
type: Class
subclass of: SpecificationsCollective
subclass of: Restriction
  on property: isComprisedOf
  some values from: SoftwareName
subclass of: Restriction
  on property: isComprisedOf
  some values from: SoftwareVersion
comment: Class containing information about the periphery's software used.
definition origin: TriboData Team at IAM-CMS at KIT, Karlsruhe, Germany
friendly name: List Item (Software Used)
persistent ID: TDO:0000490

SoftwareVersion
type: Class
subclass of: EquipmentRelatedName
comment: The version of a particular software.
definition origin: TriboData Team at IAM-CMS at KIT, Karlsruhe, Germany
friendly name: Software Version
persistent ID: TDO:0000160

SolventTypeName
type: Class
subclass of: EquipmentRelatedName
comment: The type of solvent and the way it is referred to. The friendly way to identify it.
definition origin: TriboData Team at IAM-CMS at KIT, Karlsruhe, Germany
friendly name: Solvent Type
persistent ID: TDO:0000161

SparkOutRotarySpeedSetpoint
type: Class
subclass of: CupGrindingProcessSetting
subclass of: Restriction
  on property: hasQuantification
  some values from: AngularVelocitySetpointMagnitude
comment: Instances of this class characterize the specimen positioning system rotary speed during spark out phase. Only needed if the value is different from the value for key 'Workpiece positioning system rotary speed'.
definition origin: TriboData Team at IAM-CMS at KIT, Karlsruhe, Germany
friendly name: Spark Out Rotary Speed
persistent ID: TDO:0000294

SparkOutTableRotationsSetpoint
type: Class
subclass of: CupGrindingProcessSetting
subclass of: Restriction
  on property: hasCount
  some values from: float
comment: Instances of this class characterize the spark out time given in number of table rotations.
definition origin: TriboData Team at IAM-CMS at KIT, Karlsruhe, Germany
friendly name: Spark Out Table Rotations
persistent ID: TDO:0000295

SparkOutTimeSetpoint
type: Class
subclass of: CupGrindingProcessSetting
subclass of: Restriction
  on property: hasQuantification
  some values from: TimeDuration
comment: Instances of this class characterize the time the machine is allowed to spark out after the last feed, i.e. grind with low pressure.
definition origin: TriboData Team at IAM-CMS at KIT, Karlsruhe, Germany
friendly name: Spark Out Time
persistent ID: TDO:0000296

SpecimenClampingMethod
type: Class
subclass of: ClampingMethod
comment: Way of of clamping of a physical object.
definition origin: TriboData Team at IAM-CMS at KIT, Karlsruhe, Germany
friendly name: Clamping Method
persistent ID: TDO:0000188

SpecimenCleaningProcedureType
type: Class
subclass of: DeliveryMethod
comment: Instances of this class specify the classification type of specimen cleaning procedure.
definition origin: TriboData Team at IAM-CMS at KIT, Karlsruhe, Germany
friendly name: Specimen Cleaning Procedure Type
persistent ID: TDO:0000196

SpecimenCleaningProcess
type: Class
subclass of: IndustrialProcess
subclass of: Restriction
  on property: employsEquipment
  some values from: UltrasonicCleaner
subclass of: Restriction
  on property: hasIdentifier
  some values from: ProcessGeneralIdentifyingInformation
subclass of: Restriction
  on property: isComprisedOf
  some values from: SpecimenCleaningStepsArray
subclass of: Restriction
  on property: physicallyModifies
  some values from: BlockSpecimen
comment: Class representing the physical process of reducing the amount of residue on a physical object's surfaces.
contextual type: IndustrialProcedureType
definition origin: TriboData Team at IAM-CMS at KIT, Karlsruhe, Germany
friendly name: Specimen Cleaning
persistent ID: TDO:0000531

SpecimenCleaningStepsArray
type: Class
subclass of: SpecimenCleaningProcessArray
subclass of: Restriction
  on property: isComprisedOf
  some values from: SpecimenCleaningVariablesArrayItem
comment: Class containing the ordered list of sequential steps, in terms of parameters, specific to the process.
definition origin: TriboData Team at IAM-CMS at KIT, Karlsruhe, Germany
friendly name: Specimen Cleaning Steps Array
persistent ID: TDO:0000407

SpecimenCleaningVariablesArrayItem
type: Class
subclass of: SpecimenCleaningProcessArray
subclass of: Restriction
  on property: isComprisedOf
  some values from: CleaningDurationSetpoint
subclass of: Restriction
  on property: isComprisedOf
  some values from: EquipmentNonSpecificIdentificatoryName
subclass of: Restriction
  on property: isComprisedOf
  some values from: SequentialOrderPosition
subclass of: Restriction
  on property: isComprisedOf
  some values from: SolventTypeName
subclass of: Restriction
  on property: isComprisedOf
  some values from: SpecimenCleaningProcedureType
comment: Class containing a bundle of parameters needed for a specimen cleaning process.
definition origin: TriboData Team at IAM-CMS at KIT, Karlsruhe, Germany
friendly name: List Item (Specimen Cleaning Step)
persistent ID: TDO:0000408

SpecimenDeliveryMethod
type: Class
subclass of: DeliveryMethod
comment: Instances of this class indicate the type of sample containment method for positioning it in a particular place.
definition origin: TriboData Team at IAM-CMS at KIT, Karlsruhe, Germany
friendly name: Method of Specimen Positioning
persistent ID: TDO:0000197

SpecimenGeneralIdentifyingInformation
type: Class
subclass of: IdentificatoryCollective
subclass of: Restriction
  on property: isComprisedOf
  some values from: LocationInformation
subclass of: Restriction
  on property: isComprisedOf
  some values from: ManufacturerName
subclass of: Restriction
  on property: isComprisedOf
  some values from: OperatorPersonalInformation
subclass of: Restriction
  on property: isComprisedOf
  some values from: SpecimenID
comment: Objects of this class contain information that unequivocally identifies a specimen.
definition origin: TriboData Team at IAM-CMS at KIT, Karlsruhe, Germany
friendly name: General Info
persistent ID: TDO:0000443

SpecimenID
type: Class
subclass of: InterfacialMediumRelatedName
subclass of: SpecimenRelatedName
subclass of: Restriction
  on property: hasText
  some values from: string
comment: The unique alphanumeric ID of a specimen. Could be an assigned unique ID.
definition origin: TriboData Team at IAM-CMS at KIT, Karlsruhe, Germany
friendly name: Specimen ID
persistent ID: TDO:0000165

SpeedSetpointMagnitude
type: Class
subclass of: SetpointQuantity
subclass of: Restriction
  on property: hasPhysicalUnit
  some values from: SpeedUnit
subclass of: Restriction
  on property: hasRationalNumberValue
  some values from: float
comment: The physical quantity that characterizes the phenomenon called speed.
definition origin: TriboData Team at IAM-CMS at KIT, Karlsruhe, Germany
friendly name: Speed Setpoint Magnitude
persistent ID: TDO:0000378

SpeedUnit
type: Class
subclass of: ConversionTargetUnit
subclass of: PhysicalQuantityUnit
comment: The unit that locks the meaning of the amount of the phenomenon of displacement per time.
definition origin: TriboData Team at IAM-CMS at KIT, Karlsruhe, Germany
friendly name: Speed Unit
persistent ID: TDO:0000120

SquareTubeMaximumWidth
type: Class
subclass of: BandSawSpecification
subclass of: Restriction
  on property: hasQuantification
  some values from: DistanceMagnitude
comment: The maximum permissable square tube cross-sectional width.
definition origin: TriboData Team at IAM-CMS at KIT, Karlsruhe, Germany
friendly name: Square Tube Maximum Width
persistent ID: TDO:0000229

StartingDistanceFromPlate
type: Class
subclass of: DemagnetizationProcessSetting
subclass of: Restriction
  on property: hasQuantification
  some values from: DistanceMagnitude
comment: Instances of this class give information about the distance between sample and the leading edge of the demagnetizing plate at the start of the respective demagnetizing motion.
definition origin: TriboData Team at IAM-CMS at KIT, Karlsruhe, Germany
friendly name: Motion Start Distance in Front of Demagnetizing Plate
persistent ID: TDO:0000307

StartingTemperatureSetpoint
type: Class
subclass of: FurnaceSpecification
subclass of: Restriction
  on property: hasQuantification
  some values from: TemperatureMagnitude
comment: The equipment setting which specifies the starting temperature setting of a machine.
definition origin: TriboData Team at IAM-CMS at KIT, Karlsruhe, Germany
friendly name: Starting Temperature
persistent ID: TDO:0000252

StraightnessAccuracy
type: Class
subclass of: ProfilometerSpecifications
subclass of: Restriction
  on property: hasQuantification
  some values from: DistanceMagnitude
comment: Instances of this class represent the maximum deviation from a prescribed straight motion across the entire measurement range.
definition origin: TriboData Team at IAM-CMS at KIT, Karlsruhe, Germany
friendly name: Straightness Accuracy
persistent ID: TDO:0000267

StylusTipType
type: Class
subclass of: ClassificationCategory
comment: Instances of this class specify the classification type of stylus tip.
definition origin: TriboData Team at IAM-CMS at KIT, Karlsruhe, Germany
friendly name: Stylus Tip Type
persistent ID: TDO:0000142

SubmersionMethod
type: Class
subclass of: DeliveryMethod
subclass of: Restriction
  on property: hasText
  some values from: string
comment: Way of containing a liquid during a scientific process. Only fixed, and not improvised, solutions.
definition origin: TriboData Team at IAM-CMS at KIT, Karlsruhe, Germany
friendly name: Sample Submersion Method
persistent ID: TDO:0000198

SurroundingMediumContolMethod
type: Class
subclass of: DeliveryMethod
comment: Object of this class state what type of method was used to control the susrrounding medium.
definition origin: TriboData Team at IAM-CMS at KIT, Karlsruhe, Germany
friendly name: Surrounding Medium Control Method
persistent ID: TDO:0000199

SurroundingMediumType
type: Class
subclass of: ClassificationCategory
comment: For Tribological Processes: Objects of this class act as the medium between the tribological interface, or interfacial medium (if present), and the air in the lab as a whole. This, for example, the medium in a glove box. For Other Processes: Objects of this class act as the medium around the specimen.
definition origin: TriboData Team at IAM-CMS at KIT, Karlsruhe, Germany
friendly name: Surrounding Medium
persistent ID: TDO:0000143

TactileProbeSpecificationsArray
type: Class
subclass of: TactileSurfaceProfilometerRelatedCollective
subclass of: Restriction
  on property: isComprisedOf
  some values from: MeasurementRange
subclass of: Restriction
  on property: isComprisedOf
  some values from: MeasurementResolution
subclass of: Restriction
  on property: isComprisedOf
  some values from: ProbeArmMountingMethod
subclass of: Restriction
  on property: isComprisedOf
  some values from: StylusTipType
comment: Class containing information about the technical specifications of a tactile probing system.
definition origin: TriboData Team at IAM-CMS at KIT, Karlsruhe, Germany
friendly name: Probing System
persistent ID: TDO:0000491

TactileSurfaceProfilometer
type: Class
subclass of: PoweredMachine
subclass of: Restriction
  on property: hasIdentifier
  some values from: EquipmentGeneralIdentifyingInformation
subclass of: Restriction
  on property: hasTechnicalSpecification
  some values from: TactileSurfaceProfilometerSpecificationsArray
comment: Objects of this class pertain to the category of machines called tactile surface profilometer.
contextual type: LabEquipmentType
definition origin: TriboData Team at IAM-CMS at KIT, Karlsruhe, Germany
friendly name: Tactile Surface Profilometer
persistent ID: TDO:0000523

TactileSurfaceProfilometerSpecificationsArray
type: Class
subclass of: TactileSurfaceProfilometerRelatedCollective
subclass of: Restriction
  on property: isComprisedOf
  some values from: TactileProbeSpecificationsArray
subclass of: Restriction
  on property: isComprisedOf
  some values from: TransverseSubsystemSpecificationsArray
subclass of: Restriction
  on property: isComprisedOf
  some values from: VerticalMeasuringColumnSpecificationsArray
comment: Class containing information about the technical specifications of a tactile surface profilometer.
definition origin: TriboData Team at IAM-CMS at KIT, Karlsruhe, Germany
friendly name: Technical Specifications
persistent ID: TDO:0000492

TactileSurfaceProfilometry
type: Class
subclass of: DescriptiveProcess
subclass of: Restriction
  on property: characterizesSpecimen
  some values from: BlockSpecimen
subclass of: Restriction
  on property: employsEquipment
  some values from: TactileSurfaceProfilometer
subclass of: Restriction
  on property: generatesFile
  some values from: File
subclass of: Restriction
  on property: hasFilesWithMetadata
  some values from: ExperimentOutputFileMetadataArray
subclass of: Restriction
  on property: hasIdentifier
  some values from: ProcessGeneralIdentifyingInformation
subclass of: Restriction
  on property: isControlledBy
  some values from: TactileSurfaceProfilometryInputsArray
subclass of: Restriction
  on property: isControlledBy
  some values from: UncontrolledEnvironmentalConditionsArray
subclass of: Restriction
  on property: physicallyModifies
  some values from: BlockSpecimen
comment: Class representing the monitored processes that produce a (set of) file(s) whose contents could be used for 1D visualization.
contextual type: ScientificProcedureType
definition origin: TriboData Team at IAM-CMS at KIT, Karlsruhe, Germany
friendly name: Tactile Surface Profilometry
persistent ID: TDO:0000215

TactileSurfaceProfilometryInputsArray
type: Class
subclass of: TactileSurfaceProfilometryRelatedCollective
subclass of: Restriction
  on property: isComprisedOf
  some values from: AngularOffsetBetweenMeasuredProfiles
subclass of: Restriction
  on property: isComprisedOf
  some values from: MeasurementRange
subclass of: Restriction
  on property: isComprisedOf
  some values from: NumberOfScannedProfiles
subclass of: Restriction
  on property: isComprisedOf
  some values from: TactileSurfaceProfilometryTipSpecificationsArray
subclass of: Restriction
  on property: isComprisedOf
  some values from: XOffsetBetweenMeasuredProfiles
subclass of: Restriction
  on property: isComprisedOf
  some values from: YOffsetBetweenMeasuredProfiles
comment: Class containing information about the parameters that are put into the involved scientific equipment to run it optimally.
definition origin: TriboData Team at IAM-CMS at KIT, Karlsruhe, Germany
friendly name: System/Setup Inputs
persistent ID: TDO:0000409

TactileSurfaceProfilometryRelatedCollective
type: Class
subclass of: CircumstancesCollective
comment: Class containing information about the parameters that are put into the involved scientific equipment to run it optimally.
definition origin: TriboData Team at IAM-CMS at KIT, Karlsruhe, Germany
friendly name: System/Setup Inputs

TactileSurfaceProfilometryTipSpecificationsArray
type: Class
subclass of: TactileSurfaceProfilometryRelatedCollective
subclass of: Restriction
  on property: isComprisedOf
  some values from: EquipmentID
subclass of: Restriction
  on property: isComprisedOf
  some values from: TipAngle
subclass of: Restriction
  on property: isComprisedOf
  some values from: TipRadius
comment: Class containing information about the parameters that identify the scanning tip and its use in the profilometry measurement.
definition origin: TriboData Team at IAM-CMS at KIT, Karlsruhe, Germany
friendly name: Scanning Tip Specifications
persistent ID: TDO:0000410

TargetTemperatureSetpoint
type: Class
subclass of: FurnaceSpecification
subclass of: HeatTreatmentProcessSeeting
subclass of: Restriction
  on property: hasQuantification
  some values from: TemperatureMagnitude
comment: The equipment setting which specifies the temperature setting of a machine.
definition origin: TriboData Team at IAM-CMS at KIT, Karlsruhe, Germany
friendly name: Target Heating/Cooling Temperature
persistent ID: TDO:0000253

TargetedNormalLoad
type: Class
subclass of: ModelAssumption
subclass of: Restriction
  on property: hasQuantification
  some values from: ForceMagnitude
comment: The targeted normal load as a function of another direct input (e.g. dead weight) at the beginning of a process.
definition origin: TriboData Team at IAM-CMS at KIT, Karlsruhe, Germany
friendly name: Targeted Normal Load
persistent ID: TDO:0000206

TemperatureControlDevice
type: Class
subclass of: PoweredMachine
comment: Objects of this class pertain to the category of machines called temperature controller.
definition origin: TriboData Team at IAM-CMS at KIT, Karlsruhe, Germany
friendly name: Temperature Controller
persistent ID: TDO:0000524

TemperatureControlMethod
type: Class
subclass of: DeliveryMethod
comment: The objects of this class specify the type of equipment installed in a device for cooling/heating a sample directly.
definition origin: TriboData Team at IAM-CMS at KIT, Karlsruhe, Germany
friendly name: Temperature Control Method
persistent ID: TDO:0000200

TemperatureMagnitude
type: Class
subclass of: PhysicalQuantity
subclass of: Restriction
  on property: hasPhysicalUnit
  some values from: TemperatureUnit
subclass of: Restriction
  on property: hasRationalNumberValue
  some values from: float
comment: The physical quantity that characterizes the phenomenon called temperature.
definition origin: TriboData Team at IAM-CMS at KIT, Karlsruhe, Germany
friendly name: Temperature Magnitude
persistent ID: TDO:0000382

TemperatureUnit
type: Class
subclass of: ConversionTargetUnit
subclass of: PhysicalQuantityUnit
comment: The unit that locks the meaning of the magnitude of the phenomenon of heat.
definition origin: TriboData Team at IAM-CMS at KIT, Karlsruhe, Germany
friendly name: Temperature Unit
persistent ID: TDO:0000121

TimeDuration
type: Class
subclass of: TimeMeasure
subclass of: Restriction
  on property: hasPhysicalUnit
  some values from: TimeDurationUnit
subclass of: Restriction
  on property: hasRationalNumberValue
  some values from: float
comment: Any measure of length of time, with or without respect to the universal timeline.
definition origin: SUMO Ontology (http://www.adampease.org/OP)
friendly name: Time Duration Magnitude
persistent ID: TDO:0000383

TimeDurationUnit
type: Class
subclass of: ConversionTargetUnit
subclass of: PhysicalQuantityUnit
comment: The unit that locks the meaning of the amount of the phenomenon of time.
definition origin: TriboData Team at IAM-CMS at KIT, Karlsruhe, Germany
friendly name: Time Duration Unit
persistent ID: TDO:0000122

TimeMeasure
type: Class
subclass of: PhysicalQuantity
comment: The class of temporal durations (instances of TimeDuration) and positions of TimePoints and TimeIntervals along the universal timeline (instances of TimePosition).
definition origin: SUMO Ontology (http://www.adampease.org/OP)

TimeOfLastDAQSelfCalibration
type: Class
subclass of: TimePoint
subclass of: Restriction
  on property: hasTimeStamp
  qualified cardinality: 1
  on data range: dateTimeStamp
comment: Instances of this class contain information about the time when an electronic equipment was self calibrated last (e.g. DAQ Board).
definition origin: TriboData Team at IAM-CMS at KIT, Karlsruhe, Germany
friendly name: Time of Last Self Calibration
persistent ID: TDO:0000388

TimePoint
type: Class
subclass of: TimePosition
comment: An extensionless point on the universal timeline. The TimePoints at which Processes occur can be known with various degrees of precision and approximation, but conceptually TimePoints are point-like and not interval-like. That is, it doesn't make sense to talk about how long a TimePoint lasts.
definition origin: SUMO Ontology (http://www.adampease.org/OP)

TimePosition
type: Class
subclass of: TimeMeasure
comment: Any TimePoint or TimeInterval along the universal timeline from NegativeInfinity to PositiveInfinity.
definition origin: SUMO Ontology (http://www.adampease.org/OP)

TimeSeriesContentSpecificationsArray
type: Class
subclass of: DataFileRelatedCollective
subclass of: Restriction
  on property: isComprisedOf
  some values from: TimeSeriesContentSpecificationsArrayItem
comment: Instances of this class contain the information about the content of a file (what information is stored and how to interprete it). A list (an array) of all time series contained in a file. These can be recorded sensor signals (forces, positions, ...), time stamps, test programm steps etc.
definition origin: TriboData Team at IAM-CMS at KIT, Karlsruhe, Germany
friendly name: Time Series Contents Specifications
persistent ID: TDO:0000434

TimeSeriesContentSpecificationsArrayItem
type: Class
subclass of: DataFileRelatedCollective
subclass of: Restriction
  on property: isComprisedOf
  some values from: DAQPortName
subclass of: Restriction
  on property: isComprisedOf
  some values from: MeasurementSourceCategory
subclass of: Restriction
  on property: isComprisedOf
  some values from: PhysicalQuantityUnit
subclass of: Restriction
  on property: isComprisedOf
  some values from: QuantityAbbreviation
subclass of: Restriction
  on property: isComprisedOf
  some values from: QuantityFriendlyName
subclass of: Restriction
  on property: isComprisedOf
  some values from: SamplingRateSetpoint
subclass of: Restriction
  on property: isComprisedOf
  some values from: TimeSeriesUnitConversionSpecificationsArray
comment: Instances of this class contain the information about the content of a file (what information is stored and how to interprete it). A list (an array) of all time series contained in a file. These can be recorded sensor signals (forces, positions, ...), time stamps, test programm steps etc.
definition origin: TriboData Team at IAM-CMS at KIT, Karlsruhe, Germany
friendly name: List Item (Time Series Contents Specifications)
persistent ID: TDO:0000435

TimeSeriesUnitConversionSpecificationsArray
type: Class
subclass of: DataFileRelatedCollective
subclass of: Restriction
  on property: isComprisedOf
  some values from: ConversionFactor
subclass of: Restriction
  on property: isComprisedOf
  some values from: ConversionOffset
subclass of: Restriction
  on property: isComprisedOf
  some values from: ConversionTargetUnit
comment: Instances of this class contain the information about the neccessary information to convert recorded V or mA signals into the respective physical unit. For conversion with an offset: data_in_physical_unit = (data_raw * conversion_factor) + conversion_offset
definition origin: TriboData Team at IAM-CMS at KIT, Karlsruhe, Germany
friendly name: Physical Unit Conversion Details
persistent ID: TDO:0000436

TipAngle
type: Class
subclass of: ProfilometerSpecifications
subclass of: Restriction
  on property: hasQuantification
  some values from: AngleSetpointMagnitude
comment: Instances of this class represent the angle of a measuring tip, when examined from the side in a measurement.
definition origin: TriboData Team at IAM-CMS at KIT, Karlsruhe, Germany
friendly name: Tip Angle
persistent ID: TDO:0000268

TipRadius
type: Class
subclass of: ProfilometerSpecifications
subclass of: Restriction
  on property: hasQuantification
  some values from: DistanceSetpointMagnitude
comment: Instances of this class represent the radius of a measuring tip.
definition origin: TriboData Team at IAM-CMS at KIT, Karlsruhe, Germany
friendly name: Tip Radius
persistent ID: TDO:0000269

Title
type: Class
subclass of: Name
comment: The name given to the resource by the creator or publisher. Reference: Dublin Core: http://www.lub.lu.se/cgi-bin/nmdc.pl
definition origin: SUMO Ontology (http://www.adampease.org/OP)

ToolCleaningAccessoryType
type: Class
subclass of: ClassificationCategory
comment: Instances of this class specify the classification type of tool cleaning accessory.
definition origin: TriboData Team at IAM-CMS at KIT, Karlsruhe, Germany
friendly name: Tool Cleaning Accessory Type
persistent ID: TDO:0000144

ToolCleaningTimeIntervalType
type: Class
subclass of: ClassificationCategory
comment: Instances of this class specify the classification type of tool cleaning time interval.
definition origin: TriboData Team at IAM-CMS at KIT, Karlsruhe, Germany
friendly name: Tool Cleaning Time Interval Type
persistent ID: TDO:0000145

TransverseSubsystemSpecificationsArray
type: Class
subclass of: TactileSurfaceProfilometerRelatedCollective
subclass of: Restriction
  on property: isComprisedOf
  some values from: MaximumMeasurementSpeed
subclass of: Restriction
  on property: isComprisedOf
  some values from: MeasurementRange
subclass of: Restriction
  on property: isComprisedOf
  some values from: MeasurementResolution
subclass of: Restriction
  on property: isComprisedOf
  some values from: MinimumMeasurementSpeed
subclass of: Restriction
  on property: isComprisedOf
  some values from: StraightnessAccuracy
comment: Class containing information about the technical specifications of a tactile profilometer transverse system.
definition origin: TriboData Team at IAM-CMS at KIT, Karlsruhe, Germany
friendly name: Transverse Subsystem
persistent ID: TDO:0000493

TribologicalAxisName
type: Class
subclass of: EquipmentRelatedName
comment: Field to specify for which of the general motion axis of a tribometer this subsystem is responsible.
definition origin: TriboData Team at IAM-CMS at KIT, Karlsruhe, Germany
friendly name: Axis Name
persistent ID: TDO:0000162

TribologicalExperiment
type: Class
subclass of: PhysicalExperiment
subclass of: Restriction
  on property: employsEquipment
  some values from: Tribometer
subclass of: Restriction
  on property: generatesFile
  some values from: File
subclass of: Restriction
  on property: hasFilesWithMetadata
  some values from: ExperimentOutputFileMetadataArray
subclass of: Restriction
  on property: hasIdentifier
  some values from: ProcessGeneralIdentifyingInformation
subclass of: Restriction
  on property: hasSummary
  some values from: TribologicalExperimentSummaryArray
subclass of: Restriction
  on property: isControlledBy
  some values from: TribologicalExperimentProcessInputsArray
subclass of: Restriction
  on property: isControlledBy
  some values from: TribologicalExperimentSystemInputsArray
subclass of: Restriction
  on property: isControlledBy
  some values from: UncontrolledEnvironmentalConditionsArray
subclass of: Restriction
  on property: makesUseOfConsumable
  some values from: InterfacialMedium
subclass of: Restriction
  on property: stressesAsBaseBody
  some values from: BlockSpecimen
subclass of: Restriction
  on property: stressesAsCounterBody
  some values from: BlockSpecimen
comment: Class representing the monitored processes that produce a (set of) wear track(s) on or below a physical surface.
contextual type: ScientificProcedureType
definition origin: TriboData Team at IAM-CMS at KIT, Karlsruhe, Germany
friendly name: Tribological Experiment
persistent ID: TDO:0000001

TribologicalExperimentDAQChannelsArray
type: Class
subclass of: TribologicalExperimentProcessArray
subclass of: Restriction
  on property: isComprisedOf
  some values from: TribologicalExperimentDAQChannelsArrayItem
comment: Class containing combined information about the parameters that are put into the involved DAQ channels, to run it optimally, but are not directly part of achieving the experimental objectives.
definition origin: TriboData Team at IAM-CMS at KIT, Karlsruhe, Germany
friendly name: DAQ Used Channel Info
persistent ID: TDO:0000411

TribologicalExperimentDAQChannelsArrayItem
type: Class
subclass of: TribologicalExperimentProcessArray
subclass of: Restriction
  on property: isComprisedOf
  some values from: DAQPortName
subclass of: Restriction
  on property: isComprisedOf
  some values from: DAQTerminalConfiguration
subclass of: Restriction
  on property: isComprisedOf
  some values from: MaximumVoltageSetpoint
subclass of: Restriction
  on property: isComprisedOf
  some values from: MinimumVoltageSetpoint
comment: Class containing information about the parameters that are put into the involved DAQ channels, to run it optimally, but are not directly part of achieving the experimental objectives.
definition origin: TriboData Team at IAM-CMS at KIT, Karlsruhe, Germany
friendly name: List Item (DAQ Used Channel Info)
persistent ID: TDO:0000412

TribologicalExperimentDAQRelatedInputsArray
type: Class
subclass of: TribologicalExperimentProcessArray
subclass of: Restriction
  on property: isComprisedOf
  some values from: TimeOfLastDAQSelfCalibration
subclass of: Restriction
  on property: isComprisedOf
  some values from: TribologicalExperimentDAQChannelsArray
comment: Class containing information about the parameters that are put into the involved DAQ equipment, to run it optimally, but are not directly part of achieving the experimental objectives.
definition origin: TriboData Team at IAM-CMS at KIT, Karlsruhe, Germany
friendly name: DAQ Related Inputs
persistent ID: TDO:0000413

TribologicalExperimentInputFileInfoArray
type: Class
subclass of: TribologicalExperimentProcessArray
subclass of: Restriction
  on property: isComprisedOf
  some values from: TribologicalExperimentInputFileInfoArrayItem
comment: Class containing all information about the file supplied to the controlling software to run an experiment.
definition origin: TriboData Team at IAM-CMS at KIT, Karlsruhe, Germany
friendly name: Input File/s Info
persistent ID: TDO:0000414

TribologicalExperimentInputFileInfoArrayItem
type: Class
subclass of: TribologicalExperimentProcessArray
subclass of: Restriction
  on property: isComprisedOf
  some values from: FileName
subclass of: Restriction
  on property: isComprisedOf
  some values from: FilePath
subclass of: Restriction
  on property: isComprisedOf
  some values from: FilePurpose
comment: Class containing specific information about the file supplied to the controlling software to run an experiment.
definition origin: TriboData Team at IAM-CMS at KIT, Karlsruhe, Germany
friendly name: List Item (Input File/s Info)
persistent ID: TDO:0000415

TribologicalExperimentIntefacialMediumSettingsArray
type: Class
subclass of: TribologicalExperimentProcessArray
subclass of: Restriction
  on property: isComprisedOf
  some values from: InitialAmountOfInterfacialMedium
subclass of: Restriction
  on property: isComprisedOf
  some values from: InterfacialMediumReplenishmentRateSetpoint
subclass of: Restriction
  on property: isComprisedOf
  some values from: InterfacialMediumSourcingMethod
subclass of: Restriction
  on property: isComprisedOf
  some values from: InterfacialMediumSupplyContinuityMethod
subclass of: Restriction
  on property: isComprisedOf
  some values from: InterfacialMediumSupplyMethod
comment: Instances of this class list information on the chosen parameters to define the controllables associated with the delivery of interfacial medium.
definition origin: TriboData Team at IAM-CMS at KIT, Karlsruhe, Germany
friendly name: Interfacial Medium Settings
persistent ID: TDO:0000416

TribologicalExperimentLabviewFileArray
type: Class
subclass of: TribologicalExperimentProcessArray
subclass of: Restriction
  on property: isComprisedOf
  some values from: FileName
subclass of: Restriction
  on property: isComprisedOf
  some values from: FilePath
subclass of: Restriction
  on property: isComprisedOf
  some values from: FilePurpose
comment: Class containing information about the file containing the program to run an experiment.
definition origin: TriboData Team at IAM-CMS at KIT, Karlsruhe, Germany
friendly name: LabView Program/s Info
persistent ID: TDO:0000417

TribologicalExperimentLoadingSettingsArray
type: Class
subclass of: TribologicalExperimentProcessArray
subclass of: Restriction
  on property: isComprisedOf
  some values from: DeadWeightSetpoint
subclass of: Restriction
  on property: isComprisedOf
  some values from: LoadRelaxationSetpoint
comment: Instances of this class list information on the chosen parameters to define the controllables associated with the load for mechanical interaction in the system.
definition origin: TriboData Team at IAM-CMS at KIT, Karlsruhe, Germany
friendly name: Load Settings
persistent ID: TDO:0000418

TribologicalExperimentMotionParametersArray
type: Class
subclass of: TribologicalExperimentProcessArray
subclass of: Restriction
  on property: isComprisedOf
  some values from: MotionStartingDirectionSetpoint
subclass of: Restriction
  on property: isComprisedOf
  some values from: TribologicalAxisName
comment: Instances of this class list information on the chosen parameters to define the relative motion during an experiment.
definition origin: TriboData Team at IAM-CMS at KIT, Karlsruhe, Germany
friendly name: Motion Parameters
persistent ID: TDO:0000419

TribologicalExperimentMotionSubsystemParametersArray
type: Class
subclass of: TribologicalExperimentProcessArray
subclass of: Restriction
  on property: isComprisedOf
  some values from: AOFactorSetpoint
subclass of: Restriction
  on property: isComprisedOf
  some values from: AOOffsetSetpoint
comment: Class containing information about an individual parameter and its setting related to a motion inducing subsystem.
definition origin: TriboData Team at IAM-CMS at KIT, Karlsruhe, Germany
friendly name: Motion Inducing Subsystem Parameters
persistent ID: TDO:0000420

TribologicalExperimentMotionSubsystemSettingsArray
type: Class
subclass of: TribologicalExperimentProcessArray
subclass of: Restriction
  on property: isComprisedOf
  some values from: TribologicalExperimentMotionSubsystemParametersArray
comment: Class containing information about all settings related to the motion inducing subsystems of the setup that played a role when conducting an experiment.
definition origin: TriboData Team at IAM-CMS at KIT, Karlsruhe, Germany
friendly name: Motion Inducing Subsystem Settings
persistent ID: TDO:0000421

TribologicalExperimentMountingInfoArray
type: Class
subclass of: TribologicalExperimentProcessArray
subclass of: Restriction
  on property: isComprisedOf
  some values from: TribologicalExperimentMountingInfoArrayItem
comment: Instances of this class specify the way samples were mounted and — consequently — oriented to one another at the beginning of the experiment. This array contains one entry for the base body and one entry for the counter body but may be extended as needed e.g. for experiments with more than one counter body.
definition origin: TriboData Team at IAM-CMS at KIT, Karlsruhe, Germany
friendly name: Mounting Information Array
persistent ID: TDO:0000422

TribologicalExperimentMountingInfoArrayItem
type: Class
subclass of: TribologicalExperimentProcessArray
subclass of: Restriction
  on property: isComprisedOf
  some values from: DiscHeightFluctuationSetpoint
subclass of: Restriction
  on property: isComprisedOf
  some values from: RadialPositionSetpoint
subclass of: Restriction
  on property: isComprisedOf
  some values from: SpecimenID
comment: Instances of this class specify the way samples were mounted and — consequently — oriented to one another at the beginning of the experiment. This array contains one entry for the base body and one entry for the counter body but may be extended as needed e.g. for experiments with more than one counter body.
definition origin: TriboData Team at IAM-CMS at KIT, Karlsruhe, Germany
friendly name: List Item (Mounting Information)
persistent ID: TDO:0000423

TribologicalExperimentProcessInputsArray
type: Class
subclass of: TribologicalExperimentProcessArray
subclass of: Restriction
  on property: isComprisedOf
  some values from: TribologicalExperimentIntefacialMediumSettingsArray
subclass of: Restriction
  on property: isComprisedOf
  some values from: TribologicalExperimentLoadingSettingsArray
subclass of: Restriction
  on property: isComprisedOf
  some values from: TribologicalExperimentMotionParametersArray
subclass of: Restriction
  on property: isComprisedOf
  some values from: TribologicalExperimentMountingInfoArray
subclass of: Restriction
  on property: isComprisedOf
  some values from: TribologicalExperimentVariableInputsArray
comment: Class containing information about the parameters specific to the scientific procedure.
definition origin: TriboData Team at IAM-CMS at KIT, Karlsruhe, Germany
friendly name: Experimental Conditions
persistent ID: TDO:0000424

TribologicalExperimentSummaryArray
type: Class
subclass of: TribologicalExperimentProcessArray
subclass of: Restriction
  on property: isComprisedOf
  some values from: Comment
subclass of: Restriction
  on property: isComprisedOf
  some values from: ExperimentElapsedTime
subclass of: Restriction
  on property: isComprisedOf
  some values from: ExperimentTraveledDistance
subclass of: Restriction
  on property: isComprisedOf
  some values from: PrescribedTypeOfTribologicalContact
subclass of: Restriction
  on property: isComprisedOf
  some values from: SurroundingMediumType
subclass of: Restriction
  on property: isComprisedOf
  some values from: TargetedNormalLoad
subclass of: Restriction
  on property: isComprisedOf
  some values from: TribologicalMotionType
comment: Class containing derived information aafter the experiment has finished. All derived information stems from the information recorded in other locations of the record.
definition origin: TriboData Team at IAM-CMS at KIT, Karlsruhe, Germany
friendly name: Experiment Summary
persistent ID: TDO:0000425

TribologicalExperimentSystemInputsArray
type: Class
subclass of: TribologicalExperimentProcessArray
subclass of: Restriction
  on property: isComprisedOf
  some values from: TribologicalExperimentDAQRelatedInputsArray
subclass of: Restriction
  on property: isComprisedOf
  some values from: TribologicalExperimentInputFileInfoArray
subclass of: Restriction
  on property: isComprisedOf
  some values from: TribologicalExperimentLabviewFileArray
subclass of: Restriction
  on property: isComprisedOf
  some values from: TribologicalExperimentMotionSubsystemSettingsArray
comment: Class containing information about the parameters that are put into the involved scientific equipment to run it optimally, but are not directly part of achieving the experimental objectives.
definition origin: TriboData Team at IAM-CMS at KIT, Karlsruhe, Germany
friendly name: System/Setup Inputs
persistent ID: TDO:0000426

TribologicalExperimentVariableInputsArray
type: Class
subclass of: TribologicalExperimentProcessArray
subclass of: Restriction
  on property: isComprisedOf
  some values from: TribologicalExperimentVariableInputsArrayItem
comment: Class containing the ordered list of sequential steps, in terms of parameters, specific to the process.
definition origin: TriboData Team at IAM-CMS at KIT, Karlsruhe, Germany
friendly name: Variable Experimental Steps Array
persistent ID: TDO:0000427

TribologicalExperimentVariableInputsArrayItem
type: Class
subclass of: TribologicalExperimentProcessArray
subclass of: Restriction
  on property: isComprisedOf
  some values from: SequentialOrderPosition
subclass of: Restriction
  on property: isComprisedOf
  some values from: SlidingRuntimeSetpoint
subclass of: Restriction
  on property: isComprisedOf
  some values from: SlidingSpeedSetpoint
comment: Class containing the a bundle of parameters needed for a scientific process.
definition origin: TriboData Team at IAM-CMS at KIT, Karlsruhe, Germany
friendly name: List Item (Variable Experimental Step)
persistent ID: TDO:0000428

TribologicalMotionType
type: Class
subclass of: ClassificationCategory
comment: Instances of this class give the type of relative motion between base body and counter body.
definition origin: TriboData Team at IAM-CMS at KIT, Karlsruhe, Germany
friendly name: Motion Type
persistent ID: TDO:0000146

Tribometer
type: Class
subclass of: PoweredMachine
subclass of: Restriction
  on property: hasIdentifier
  some values from: EquipmentGeneralIdentifyingInformation
subclass of: Restriction
  on property: hasTechnicalSpecification
  some values from: TribometerPeripheryInfoArray
subclass of: Restriction
  on property: hasTechnicalSpecification
  some values from: TribometerSpecificationsArray
comment: Objects of this class pertain to the category of machines that perform tribological experiments as their primary use.
contextual type: LabEquipmentType
definition origin: TriboData Team at IAM-CMS at KIT, Karlsruhe, Germany
friendly name: Tribometer
persistent ID: TDO:0000525

TribometerConnectedPCInfoArray
type: Class
subclass of: TribometerRelatedCollective
subclass of: Restriction
  on property: isComprisedOf
  some values from: EquipmentID
subclass of: Restriction
  on property: isComprisedOf
  some values from: OperatingSystemName
subclass of: Restriction
  on property: isComprisedOf
  some values from: SoftwareUsedArray
subclass of: Restriction
  on property: isComprisedOf
  some values from: TribometerPeripheryRolesArray
comment: Class containing information about the PC's connected to a tribometer.
definition origin: TriboData Team at IAM-CMS at KIT, Karlsruhe, Germany
friendly name: Connected PC
persistent ID: TDO:0000496

TribometerDAQAttributesArray
type: Class
subclass of: TribometerRelatedCollective
subclass of: Restriction
  on property: isComprisedOf
  some values from: ManufacturerName
subclass of: Restriction
  on property: isComprisedOf
  some values from: ObjectModelName
comment: Class containing attributes about the installed DAQs.
definition origin: TriboData Team at IAM-CMS at KIT, Karlsruhe, Germany
friendly name: DAQ Attributes
persistent ID: TDO:0000497

TribometerDAQInfoArray
type: Class
subclass of: TribometerRelatedCollective
subclass of: Restriction
  on property: isComprisedOf
  some values from: TribometerDAQInfoArrayItem
comment: Class containing information about all the installed DAQ boards relevant to the tribometer's measurement.
definition origin: TriboData Team at IAM-CMS at KIT, Karlsruhe, Germany
friendly name: Array of Info on Connected DAQs
persistent ID: TDO:0000498

TribometerDAQInfoArrayItem
type: Class
subclass of: TribometerRelatedCollective
subclass of: Restriction
  on property: isComprisedOf
  some values from: DAQInterfaceName
subclass of: Restriction
  on property: isComprisedOf
  some values from: TribometerDAQAttributesArray
comment: Class containing information about all the installed DAQ boards relevant to the tribometer's measurement.
definition origin: TriboData Team at IAM-CMS at KIT, Karlsruhe, Germany
friendly name: List Item (Info on Connected DAQ)
persistent ID: TDO:0000499

TribometerMotionControllerAttributesArray
type: Class
subclass of: TribometerRelatedCollective
subclass of: Restriction
  on property: isComprisedOf
  some values from: ManufacturerName
subclass of: Restriction
  on property: isComprisedOf
  some values from: ObjectModelName
comment: Class containing attributes about the installed subsystems' controller responsible for making parts move in the tribometer.
definition origin: TriboData Team at IAM-CMS at KIT, Karlsruhe, Germany
friendly name: Controller Attributes
persistent ID: TDO:0000500

TribometerMotionInducingComponentsInfoArray
type: Class
subclass of: TribometerRelatedCollective
subclass of: Restriction
  on property: isComprisedOf
  some values from: TribometerMotionInducingComponentsInfoArrayItem
comment: Class containing information about the installed subsystems responsible for making parts move in the tribometer.
definition origin: TriboData Team at IAM-CMS at KIT, Karlsruhe, Germany
friendly name: Motion Inducing Subsystems Info Array
persistent ID: TDO:0000501

TribometerMotionInducingComponentsInfoArrayItem
type: Class
subclass of: TribometerRelatedCollective
subclass of: Restriction
  on property: isComprisedOf
  some values from: EquipmentDistanceResolution
subclass of: Restriction
  on property: isComprisedOf
  some values from: MotionDeliveryMethod
subclass of: Restriction
  on property: isComprisedOf
  some values from: TribologicalAxisName
subclass of: Restriction
  on property: isComprisedOf
  some values from: TribometerMotionControllerAttributesArray
subclass of: Restriction
  on property: isComprisedOf
  some values from: TribometerMotionSubsystemAttributesArray
comment: Class containing information about the installed subsystems responsible for making parts move in the tribometer.
definition origin: TriboData Team at IAM-CMS at KIT, Karlsruhe, Germany
friendly name: List Item (Motion Inducing Subsystems Info Array)
persistent ID: TDO:0000502

TribometerMotionSubsystemAttributesArray
type: Class
subclass of: TribometerRelatedCollective
subclass of: Restriction
  on property: isComprisedOf
  some values from: ManufacturerName
subclass of: Restriction
  on property: isComprisedOf
  some values from: ObjectModelName
comment: Class containing attributes about the installed subsystems responsible for making parts move in the tribometer.
definition origin: TriboData Team at IAM-CMS at KIT, Karlsruhe, Germany
friendly name: Motion Inducing Subsystems Attributes
persistent ID: TDO:0000503

TribometerPeripheryInfoArray
type: Class
subclass of: TribometerRelatedCollective
subclass of: Restriction
  on property: isComprisedOf
  some values from: TribometerConnectedPCInfoArray
comment: Class containing information about the periphery components connected to a tribometer.
definition origin: TriboData Team at IAM-CMS at KIT, Karlsruhe, Germany
friendly name: Periphery Info
persistent ID: TDO:0000504

TribometerPeripheryRolesArray
type: Class
subclass of: TribometerRelatedCollective
subclass of: Restriction
  on property: isComprisedOf
  some values from: EquipmentRole
comment: Class containing information about the periphery's role/s in a tribometer.
definition origin: TriboData Team at IAM-CMS at KIT, Karlsruhe, Germany
friendly name: List of Equipment Roles
persistent ID: TDO:0000505

TribometerSpecificationsArray
type: Class
subclass of: TribometerRelatedCollective
subclass of: Restriction
  on property: isComprisedOf
  some values from: SensorInfoArray
subclass of: Restriction
  on property: isComprisedOf
  some values from: TribometerDAQInfoArray
subclass of: Restriction
  on property: isComprisedOf
  some values from: TribometerMotionInducingComponentsInfoArray
subclass of: Restriction
  on property: isComprisedOf
  some values from: TribometerStructuralInfoArray
comment: Class containing information about the technical Specifications of a Tribometer
definition origin: TriboData Team at IAM-CMS at KIT, Karlsruhe, Germany
friendly name: Technical Specifications
persistent ID: TDO:0000508

TribometerStructuralInfoArray
type: Class
subclass of: TribometerRelatedCollective
subclass of: Restriction
  on property: isComprisedOf
  some values from: BaseSpecimenClampingMethod
subclass of: Restriction
  on property: isComprisedOf
  some values from: CounterSpecimenClampingMethod
subclass of: Restriction
  on property: isComprisedOf
  some values from: HousingMethod
subclass of: Restriction
  on property: isComprisedOf
  some values from: LoadApplicationMethod
subclass of: Restriction
  on property: isComprisedOf
  some values from: SubmersionMethod
subclass of: Restriction
  on property: isComprisedOf
  some values from: TemperatureControlMethod
subclass of: Restriction
  on property: isComprisedOf
  some values from: VibrationMitigationMethod
comment: Class containing information about the technical Structural Specifications of a Tribometer
definition origin: TriboData Team at IAM-CMS at KIT, Karlsruhe, Germany
friendly name: Structural Information
persistent ID: TDO:0000509

TurningDirectionSetpoint
type: Class
subclass of: CupGrindingMachineSpecification
comment: The direction of motion when the relative (with respect to the machine) motion sets in.
definition origin: TriboData Team at IAM-CMS at KIT, Karlsruhe, Germany
friendly name: Turning Direction
persistent ID: TDO:0000242

TurningFrequencySetpoint
type: Class
subclass of: CupGrindingProcessSetting
subclass of: Restriction
  on property: hasQuantification
  some values from: FrequencyMagnitude
comment: Instances of this class quantify the turning frequency in a process.
definition origin: TriboData Team at IAM-CMS at KIT, Karlsruhe, Germany
friendly name: Turning Frequency
persistent ID: TDO:0000297

UltrasonicCleaner
type: Class
subclass of: PoweredMachine
subclass of: Restriction
  on property: hasIdentifier
  some values from: EquipmentGeneralIdentifyingInformation
subclass of: Restriction
  on property: hasTechnicalSpecification
  some values from: UltrasonicCleanerSpecificationsArray
comment: Objects of this class pertain to the category of machines called ultrasonic cleaner.
contextual type: LabEquipmentType
definition origin: TriboData Team at IAM-CMS at KIT, Karlsruhe, Germany
friendly name: Ultrasonic Cleaner
persistent ID: TDO:0000526

UltrasonicCleanerSpecificationsArray
type: Class
subclass of: SpecificationsCollective
subclass of: Restriction
  on property: isComprisedOf
  some values from: MaximumDurationSetpoint
subclass of: Restriction
  on property: isComprisedOf
  some values from: MinimumDurationSetpoint
subclass of: Restriction
  on property: isComprisedOf
  some values from: PowerConsumption
subclass of: Restriction
  on property: isComprisedOf
  some values from: PowerSupplyVoltage
subclass of: Restriction
  on property: isComprisedOf
  some values from: WorkingAreaHeight
subclass of: Restriction
  on property: isComprisedOf
  some values from: WorkingAreaLength
subclass of: Restriction
  on property: isComprisedOf
  some values from: WorkingAreaWidth
subclass of: Restriction
  on property: isComprisedOf
  some values from: WorkingFrequencySetpoint
comment: Class containing information about the technical specifications of a ultrasonic cleaner.
definition origin: TriboData Team at IAM-CMS at KIT, Karlsruhe, Germany
friendly name: Technical Specifications
persistent ID: TDO:0000510

UncontrolledAtmosphericPressure
type: Class
subclass of: UncontrolledExperimentalCondition
subclass of: Restriction
  on property: hasQuantification
  some values from: AtmosphericPressureMagnitude
comment: The phenomenon called atmospheric pressure of the surroundings.
definition origin: TriboData Team at IAM-CMS at KIT, Karlsruhe, Germany
friendly name: Uncontrolled Atmospheric Pressure
persistent ID: TDO:0000354

UncontrolledEnvironmentRelativeHumidity
type: Class
subclass of: UncontrolledExperimentalCondition
subclass of: Restriction
  on property: hasQuantification
  some values from: RelativeHumidityMagnitude
comment: The phenomenon called relative humidity of the surrounding environment.
definition origin: TriboData Team at IAM-CMS at KIT, Karlsruhe, Germany
friendly name: Uncontrolled Environment Relative Humidity
persistent ID: TDO:0000355

UncontrolledEnvironmentTemperature
type: Class
subclass of: UncontrolledExperimentalCondition
subclass of: Restriction
  on property: hasQuantification
  some values from: TemperatureMagnitude
comment: The phenomenon called temperature of the surroundings.
definition origin: TriboData Team at IAM-CMS at KIT, Karlsruhe, Germany
friendly name: Uncontrolled Environment Temperature
persistent ID: TDO:0000356

UncontrolledEnvironmentalConditionsArray
type: Class
subclass of: CircumstancesCollective
subclass of: Restriction
  on property: isComprisedOf
  some values from: UncontrolledAtmosphericPressure
subclass of: Restriction
  on property: isComprisedOf
  some values from: UncontrolledEnvironmentRelativeHumidity
subclass of: Restriction
  on property: isComprisedOf
  some values from: UncontrolledEnvironmentTemperature
comment: Information on surrounding conditions that are not actively chosen or controlled by the researcher, which, however, might play a role in the outcome of the scientific process (e.g. "moon phase", "weather", ...). Correlations might show up only once a big enough (well-curated) dataset is produced.
definition origin: TriboData Team at IAM-CMS at KIT, Karlsruhe, Germany
friendly name: Uncontrolled Environmental Conditions
persistent ID: TDO:0000429

UnitlessQuantitySetpointMagnitude
type: Class
subclass of: SetpointQuantity
subclass of: Restriction
  on property: hasRationalNumberValue
  some values from: float
comment: The physical quantity that characterizes a phenomenon with no units.
definition origin: TriboData Team at IAM-CMS at KIT, Karlsruhe, Germany
friendly name: Unitless Quantity Setpoint Magnitude
persistent ID: TDO:0000379

UserToken
type: Class
subclass of: OperatorPersonalIdentifiers
subclass of: Restriction
  on property: hasText
  some values from: string
comment: Operator's abbreviation (if existent). Only needed for users of the Fraunhofer IWM.
definition origin: TriboData Team at IAM-CMS at KIT, Karlsruhe, Germany
friendly name: User Token
persistent ID: TDO:0000171

Variable
type: Class
subclass of: Proposition
comment: A quantity which during a calculation is assumed to vary or be capable of varying in value (mathematics). FROM https://www.lexico.com/en/definition/variable
definition origin: tribAIn Ontology (https://github.com/snow0815/tribAIn)

VerticalEndPosition
type: Class
subclass of: ExperimentalOutput
subclass of: Restriction
  on property: hasQuantification
  some values from: DistanceSetpointMagnitude
comment: Instances of this class characterize the vertical end height in a process.
definition origin: TriboData Team at IAM-CMS at KIT, Karlsruhe, Germany
friendly name: Vertical End Position
persistent ID: TDO:0000289

VerticalInfeedTableRotationsIntervalSetpoint
type: Class
subclass of: CupGrindingProcessSetting
subclass of: Restriction
  on property: hasCount
  some values from: float
comment: Instances of this class characterize the number of 360° rotations the sample mounting table completes in between two infeed steps.
definition origin: TriboData Team at IAM-CMS at KIT, Karlsruhe, Germany
friendly name: Vertical Infeed Table Rotations Interval
persistent ID: TDO:0000298

VerticalInfeedTimeIntervalSetpoint
type: Class
subclass of: CupGrindingProcessSetting
subclass of: Restriction
  on property: hasQuantification
  some values from: TimeDuration
comment: Instances of this class characterize the vertical infeed time interval in a process. i.e. The time in between two individual infeed operations.
definition origin: TriboData Team at IAM-CMS at KIT, Karlsruhe, Germany
friendly name: Vertical Infeed Time Interval
persistent ID: TDO:0000299

VerticalMeasuringColumnSpecificationsArray
type: Class
subclass of: TactileSurfaceProfilometerRelatedCollective
subclass of: Restriction
  on property: isComprisedOf
  some values from: MaximumTravelSpeed
subclass of: Restriction
  on property: isComprisedOf
  some values from: MinimumTravelSpeed
subclass of: Restriction
  on property: isComprisedOf
  some values from: PositionalRepeatability
subclass of: Restriction
  on property: isComprisedOf
  some values from: ZTravelRange
comment: Class containing information about the technical specifications of a tactile profilometer vertical measuring column.
definition origin: TriboData Team at IAM-CMS at KIT, Karlsruhe, Germany
friendly name: Vertical Measuring Column Subsystem
persistent ID: TDO:0000494

VerticalStartingPosition
type: Class
subclass of: CupGrindingProcessSetting
subclass of: Restriction
  on property: hasQuantification
  some values from: DistanceSetpointMagnitude
comment: Instances of this class characterize the vertical start height in a process.
definition origin: TriboData Team at IAM-CMS at KIT, Karlsruhe, Germany
friendly name: Vertical Starting Position
persistent ID: TDO:0000300

VerticalStepSizeSetpoint
type: Class
subclass of: CupGrindingProcessSetting
subclass of: Restriction
  on property: hasQuantification
  some values from: DistanceSetpointMagnitude
comment: Instances of this class characterize the vertical step size in a process.
definition origin: TriboData Team at IAM-CMS at KIT, Karlsruhe, Germany
friendly name: Vertical Step Size
persistent ID: TDO:0000301

VibrationMitigationMethod
type: Class
subclass of: DeliveryMethod
comment: Object of this class provide information about the mounting base or foundation the measurment equipment sits on. This influences how vibrations created due to an experiment interact with the surroundings and how vibrations from the environment might influence the outcome of an experiment.
definition origin: TriboData Team at IAM-CMS at KIT, Karlsruhe, Germany
friendly name: Vibration Mitigation Method
persistent ID: TDO:0000201

VoltageMagnitude
type: Class
subclass of: PhysicalQuantity
subclass of: Restriction
  on property: hasPhysicalUnit
  some values from: VoltageUnit
subclass of: Restriction
  on property: hasRationalNumberValue
  some values from: float
comment: The physical quantity that characterizes the voltage of a circuit.
definition origin: TriboData Team at IAM-CMS at KIT, Karlsruhe, Germany
friendly name: Voltage Magnitude
persistent ID: TDO:0000389

VoltageUnit
type: Class
subclass of: ConversionTargetUnit
subclass of: PhysicalQuantityUnit
comment: The unit that locks the meaning of the magnitude of the phenomenon of voltage.
definition origin: TriboData Team at IAM-CMS at KIT, Karlsruhe, Germany
friendly name: Voltage Unit
persistent ID: TDO:0000123

VolumeSetpointMagnitude
type: Class
subclass of: SetpointQuantity
subclass of: Restriction
  on property: hasPhysicalUnit
  some values from: VolumeUnit
subclass of: Restriction
  on property: hasRationalNumberValue
  some values from: float
comment: The physical quantity that characterizes the phenomenon called volume.
definition origin: TriboData Team at IAM-CMS at KIT, Karlsruhe, Germany
friendly name: Volume Setpoint Magnitude
persistent ID: TDO:0000380

VolumeUnit
type: Class
subclass of: ConversionTargetUnit
subclass of: PhysicalQuantityUnit
comment: The unit that locks the meaning of the amount of the phenomenon called volume.
definition origin: TriboData Team at IAM-CMS at KIT, Karlsruhe, Germany
friendly name: Volume Unit
persistent ID: TDO:0000125

VolumetricRateSetpointMagnitude
type: Class
subclass of: SetpointQuantity
subclass of: Restriction
  on property: hasPhysicalUnit
  some values from: VolumetricRateUnit
subclass of: Restriction
  on property: hasRationalNumberValue
  some values from: float
comment: The physical quantity that characterizes the phenomenon describing volume per time.
definition origin: TriboData Team at IAM-CMS at KIT, Karlsruhe, Germany
friendly name: Volumetric Rate Setpoint Magnitude
persistent ID: TDO:0000381

VolumetricRateUnit
type: Class
subclass of: ConversionTargetUnit
subclass of: PhysicalQuantityUnit
comment: The unit that locks the meaning of the amount of the phenomenon called volume per time.
definition origin: TriboData Team at IAM-CMS at KIT, Karlsruhe, Germany
friendly name: Volumetric Rate Unit
persistent ID: TDO:0000124

WattageMagnitude
type: Class
subclass of: PhysicalQuantity
subclass of: Restriction
  on property: hasPhysicalUnit
  some values from: PowerUnit
subclass of: Restriction
  on property: hasRationalNumberValue
  some values from: float
comment: The physical quantity that characterizes the power of an energy exchange.
definition origin: TriboData Team at IAM-CMS at KIT, Karlsruhe, Germany
friendly name: Wattage Magnitude
persistent ID: TDO:0000390

WetGrindingAbility
type: Class
subclass of: ClassificationCategory
subclass of: Restriction
  on property: hasBoolean
  some values from: boolean
comment: Boolean that indicates whether the grinding machine is properly equipped for wet grinding processes i.e. utilizing a liquid cooling medium. Often this is realized by some sort of enhousing or fume hood.
definition origin: TriboData Team at IAM-CMS at KIT, Karlsruhe, Germany
friendly name: Equipped for Wet Grinding
persistent ID: TDO:0000147

WorkingAreaHeight
type: Class
subclass of: EquipmentSpecification
subclass of: Restriction
  on property: hasQuantification
  some values from: DistanceMagnitude
comment: Instances of this class specify the available height of the volume for manipulation within a machine. *height is defined in the natural orientation of the equipment.
definition origin: TriboData Team at IAM-CMS at KIT, Karlsruhe, Germany
friendly name: Working Area Height
persistent ID: TDO:0000281

WorkingAreaLength
type: Class
subclass of: EquipmentSpecification
subclass of: Restriction
  on property: hasQuantification
  some values from: DistanceMagnitude
comment: Instances of this class specify the available length of the area for manipulation within a machine. *Length is longer than Width.
definition origin: TriboData Team at IAM-CMS at KIT, Karlsruhe, Germany
friendly name: Working Area Length
persistent ID: TDO:0000282

WorkingAreaWidth
type: Class
subclass of: EquipmentSpecification
subclass of: Restriction
  on property: hasQuantification
  some values from: DistanceMagnitude
comment: Instances of this class specify the available width of the area for manipulation within a machine. *Length is longer than Width.
definition origin: TriboData Team at IAM-CMS at KIT, Karlsruhe, Germany
friendly name: Working Area Width
persistent ID: TDO:0000283

WorkingFrequencySetpoint
type: Class
subclass of: EquipmentSpecification
subclass of: Restriction
  on property: hasQuantification
  some values from: FrequencyMagnitude
comment: Instances of this class quantify the frequency in a process that a machine supports.
definition origin: TriboData Team at IAM-CMS at KIT, Karlsruhe, Germany
friendly name: Working Frequency
persistent ID: TDO:0000284

XMeasurementOffset
type: Class
subclass of: SurfaceProfilometrySetting
subclass of: Restriction
  on property: hasQuantification
  some values from: DistanceMagnitude
comment: Instances of this class characterize the measurement offset in x-direction as defined by the equipment.
definition origin: TriboData Team at IAM-CMS at KIT, Karlsruhe, Germany
friendly name: X Offset
persistent ID: TDO:0000315

XMeasurementRange
type: Class
subclass of: ProfilometerSpecifications
subclass of: Restriction
  on property: hasQuantification
  some values from: DistanceMagnitude
comment: Instances of this class represent the maximum range of values in x-direction (first lateral) that the system can capture in one acquisition process/one measurement. The axes are the natural ones defined by the manufacturer or when looked at the natural orientation of the machine.
definition origin: TriboData Team at IAM-CMS at KIT, Karlsruhe, Germany
friendly name: X-direction Measurement Range
persistent ID: TDO:0000270

XMeasurementResolution
type: Class
subclass of: ProfilometerSpecifications
subclass of: Restriction
  on property: hasQuantification
  some values from: DistanceMagnitude
comment: Instances of this class represent the x-axis/main lateral axis/fast axis resolution that the system can capture. The axes are the natural ones defined by the manufacturer or when looked at the natural orientation of the machine.
definition origin: TriboData Team at IAM-CMS at KIT, Karlsruhe, Germany
friendly name: X-direction Measurement Resolution
persistent ID: TDO:0000271

XNumberOfPoints
type: Class
subclass of: SurfaceProfilometrySetting
subclass of: Restriction
  on property: hasCount
  some values from: integer
comment: Instances of this class characterize the measurement number of scanning points per line in x-direction, as defined by the equipment.
definition origin: TriboData Team at IAM-CMS at KIT, Karlsruhe, Germany
friendly name: X Number of Points
persistent ID: TDO:0000316

XOffsetBetweenMeasuredProfiles
type: Class
subclass of: SurfaceProfilometrySetting
subclass of: Restriction
  on property: hasQuantification
  some values from: DistanceSetpointMagnitude
comment: Instances of this class characterize the measurement offset in x-direction when multiple profiles from the same sample are taken.
definition origin: TriboData Team at IAM-CMS at KIT, Karlsruhe, Germany
friendly name: X Offset Between Profiles
persistent ID: TDO:0000317

XTravelRange
type: Class
subclass of: ProfilometerSpecifications
subclass of: Restriction
  on property: hasQuantification
  some values from: DistanceMagnitude
comment: Instances of this class represent the distance between the lower and upper limits of the x-axis/main lateral axis/fast axis. The axes are the natural ones defined by the manufacturer or when looked at the natural orientation of the machine.
definition origin: TriboData Team at IAM-CMS at KIT, Karlsruhe, Germany
friendly name: X-direction Travel Range
persistent ID: TDO:0000272

YMeasurementOffset
type: Class
subclass of: SurfaceProfilometrySetting
subclass of: Restriction
  on property: hasQuantification
  some values from: DistanceMagnitude
comment: Instances of this class characterize the measurement offset in y-direction as defined by the equipment.
definition origin: TriboData Team at IAM-CMS at KIT, Karlsruhe, Germany
friendly name: Y Offset
persistent ID: TDO:0000318

YMeasurementRange
type: Class
subclass of: ProfilometerSpecifications
subclass of: Restriction
  on property: hasQuantification
  some values from: DistanceMagnitude
comment: Instances of this class represent the maximum range of values in y-direction (second lateral) that the system can capture in one acquisition process/one measurement. The axes are the natural ones defined by the manufacturer or when looked at the natural orientation of the machine.
definition origin: TriboData Team at IAM-CMS at KIT, Karlsruhe, Germany
friendly name: Y-direction Measurement Range
persistent ID: TDO:0000273

YMeasurementResolution
type: Class
subclass of: ProfilometerSpecifications
subclass of: Restriction
  on property: hasQuantification
  some values from: DistanceMagnitude
comment: Instances of this class represent the y-axis/secondary lateral axis/slow axis resolution that the system can capture. The axes are the natural ones defined by the manufacturer or when looked at the natural orientation of the machine.
definition origin: TriboData Team at IAM-CMS at KIT, Karlsruhe, Germany
friendly name: Y-direction Measurement Resolution
persistent ID: TDO:0000274

YNumberOfPoints
type: Class
subclass of: SurfaceProfilometrySetting
subclass of: Restriction
  on property: hasCount
  some values from: integer
comment: Instances of this class characterize the measurement number of scanning points per line in y-direction, as defined by the equipment.
definition origin: TriboData Team at IAM-CMS at KIT, Karlsruhe, Germany
friendly name: Y Number of Points
persistent ID: TDO:0000319

YOffsetBetweenMeasuredProfiles
type: Class
subclass of: SurfaceProfilometrySetting
subclass of: Restriction
  on property: hasQuantification
  some values from: DistanceSetpointMagnitude
comment: Instances of this class characterize the measurement offset in y-direction when multiple profiles from the same sample are taken.
definition origin: TriboData Team at IAM-CMS at KIT, Karlsruhe, Germany
friendly name: Y Offset Between Profiles
persistent ID: TDO:0000320

YTravelRange
type: Class
subclass of: ProfilometerSpecifications
subclass of: Restriction
  on property: hasQuantification
  some values from: DistanceMagnitude
comment: Instances of this class represent the distance between the lower and upper limits of the y-axis/secondary lateral axis/slow axis. The axes are the natural ones defined by the manufacturer or when looked at the natural orientation of the machine.
definition origin: TriboData Team at IAM-CMS at KIT, Karlsruhe, Germany
friendly name: Y-direction Travel Range
persistent ID: TDO:0000275

ZMaximumMeasurementSpeed
type: Class
subclass of: ProfilometerSpecifications
subclass of: Restriction
  on property: hasQuantification
  some values from: SpeedSetpointMagnitude
comment: Instances of this class represent the maximum z-direction (vertical) speed at which the system can capture. The axes are the natural ones defined by the manufacturer or when looked at the natural orientation of the machine.
definition origin: TriboData Team at IAM-CMS at KIT, Karlsruhe, Germany
friendly name: Z-direction Maximum Measurement Speed
persistent ID: TDO:0000276

ZMeasurementRange
type: Class
subclass of: ProfilometerSpecifications
subclass of: Restriction
  on property: hasQuantification
  some values from: DistanceMagnitude
comment: Instances of this class represent the maximum range of values in z-direction (vertical) that the system can capture in one acquisition process/one measurement. The axes are the natural ones defined by the manufacturer or when looked at the natural orientation of the machine.
definition origin: TriboData Team at IAM-CMS at KIT, Karlsruhe, Germany
friendly name: Z-direction Measurement Range
persistent ID: TDO:0000277

ZMeasurementResolution
type: Class
subclass of: ProfilometerSpecifications
subclass of: Restriction
  on property: hasQuantification
  some values from: DistanceMagnitude
comment: Instances of this class represent the z-direction (vertical) resolution that the system can capture. The axes are the natural ones defined by the manufacturer or when looked at the natural orientation of the machine.
definition origin: TriboData Team at IAM-CMS at KIT, Karlsruhe, Germany
friendly name: Z-direction Measurement Resolution
persistent ID: TDO:0000278

ZMinimumMeasurementSpeed
type: Class
subclass of: ProfilometerSpecifications
subclass of: Restriction
  on property: hasQuantification
  some values from: SpeedSetpointMagnitude
comment: Instances of this class represent the minimum z-direction (vertical) speed at which the system can capture. The axes are the natural ones defined by the manufacturer or when looked at the natural orientation of the machine.
definition origin: TriboData Team at IAM-CMS at KIT, Karlsruhe, Germany
friendly name: Z-direction Minimum Measurement Speed
persistent ID: TDO:0000279

ZTravelRange
type: Class
subclass of: ProfilometerSpecifications
subclass of: Restriction
  on property: hasQuantification
  some values from: DistanceMagnitude
comment: Instances of this class represent the distance between the lower and upper limits of the z-axis/vertical axis. The axes are the natural ones defined by the manufacturer or when looked at the natural orientation of the machine.
definition origin: TriboData Team at IAM-CMS at KIT, Karlsruhe, Germany
friendly name: Z-direction Travel Range
persistent ID: TDO:0000280

Acetone
type: NamedIndividual
type: SolventTypeName
friendly name: Acetone

AirDryCleaning
type: NamedIndividual
type: SpecimenCleaningProcedureType
friendly name: Air Dry

AirHumidityControlled
type: NamedIndividual
type: SurroundingMediumType
friendly name: Air (Humidity Controlled)

AirJetColdCleaning
type: NamedIndividual
type: SpecimenCleaningProcedureType
friendly name: Cold Air Jet

AirJetWarmCleaning
type: NamedIndividual
type: SpecimenCleaningProcedureType
friendly name: Warm Air Jet

AirUnconditioned
type: NamedIndividual
type: SurroundingMediumType
friendly name: Air (Unconditioned)

Al2O3Formula
type: NamedIndividual
type: MaterialEmpiricalFormula
friendly name: Al2O3

AloisSchmittGmbHCo
type: NamedIndividual
type: ManufacturerName
friendly name: Alois Schmitt GmbH & Co. KG

AutomaticMode
type: NamedIndividual
type: InfeedMode
friendly name: Automatic

BNC
type: NamedIndividual
type: ManufacturerName
friendly name: BNC

BachelorCandidate
type: NamedIndividual
type: ProfessionalCapacity
friendly name: Bachelor Candidate

BackAndForthDirection
type: NamedIndividual
type: DemagnetizingMotionDIrection
friendly name: Back and Forth

BackSide
type: NamedIndividual
type: BlockSpecimenOrientationIndicatingFeatureSide
type: BlockSpecimenPrincipalTribologicalSide
friendly name: Back

BaseBodyRotationAxis
type: NamedIndividual
type: TribologicalAxisName
friendly name: Base Body Rotation

BaseBodyTiltAxis
type: NamedIndividual
type: TribologicalAxisName
friendly name: Base Body Tilt

BigEndianOrdering
type: NamedIndividual
type: BinaryFileBytesBitsOrder
friendly name: Big-Endian Ordering

BigEndianOrdering64Bit
type: NamedIndividual
type: BinaryFileBytesBitsOrder
friendly name: Big-Endian Ordering, 64-Bit Long Data Type

Bit
type: NamedIndividual
type: FileSizeUnit
friendly name: bit

BlowDryer
type: NamedIndividual
type: EquipmentNonSpecificIdentificatoryName
friendly name: Blow Dryer

BlowingWIthCompressedAirCleaning
type: NamedIndividual
type: SpecimenCleaningProcedureType
comment: Remove loose particles/dust/residue by applying compressed air.
friendly name: Blowing With Compressed Air

BoltMandrelMounting
type: NamedIndividual
type: BaseSpecimenClampingMethod
type: CounterSpecimenClampingMethod
type: SpecimenClampingMethod
friendly name: Bolt (Mandrel)

BoltMounting
type: NamedIndividual
type: BaseSpecimenClampingMethod
type: CounterSpecimenClampingMethod
type: SpecimenClampingMethod
comment: A bolt or bolts compressing the specimen directly to the machinery's construction.
friendly name: Bolt

BoschVS15665OL
type: NamedIndividual
type: BoschStandard
friendly name: VS 15665-OL

BottomSide
type: NamedIndividual
type: BlockSpecimenOrientationIndicatingFeatureSide
type: BlockSpecimenPrincipalTribologicalSide
friendly name: Bottom

BrinellHardnessMeasurement
type: NamedIndividual
type: HardnessMeasurementType
friendly name: Brinell

BrinellIndenterType
type: NamedIndividual
type: IndenterType
friendly name: Brinell

CAV710106
type: NamedIndividual
type: CAVStandard
friendly name: 7-10-106

CHR150NProfilometer
type: NamedIndividual
type: ObjectModelName
friendly name: CHR 150 N

CapOnBoltMounting
type: NamedIndividual
type: BaseSpecimenClampingMethod
type: CounterSpecimenClampingMethod
type: SpecimenClampingMethod
comment: A cap that compresses the specimen around its periphery while being tightened on the end of a threaded rod, in turn attached to equipment.
friendly name: Cap on Bolt

CapacitiveSensing
type: NamedIndividual
type: SensoringMethod
friendly name: Capacitive Sensing

Category2MagneticFielEmission
type: NamedIndividual
type: MagneticFieldEmissionClassification
friendly name: Category 2

CementedCarbide
type: NamedIndividual
type: MaterialCategory
friendly name: Cemented Carbide

CentiMeterUnit
type: NamedIndividual
type: DistanceUnit
friendly name: cm

CentreSuissedElectroniqueetdeMicrotechnique
type: NamedIndividual
type: ManufacturerName
friendly name: Centre Suisse d'Electronique et de Microtechnique

Ceramic
type: NamedIndividual
type: MaterialCategory
friendly name: Ceramic

ChromaticAberrationProfilometry
type: NamedIndividual
type: SensoringMethod
friendly name: Chromatic Aberration

CleaningTag
type: NamedIndividual
type: Kadi4MatRecordTags
friendly name: cleaning

ClimateBoxHousing
type: NamedIndividual
type: HousingMethod
friendly name: Climate Box

ClockwiseDirection
type: NamedIndividual
type: MotionStartingDirectionSetpoint
type: TurningDirectionSetpoint
friendly name: Clockwise

CoarseRoughnessAdjustmentCupGrindingGoal
type: NamedIndividual
type: CupGrindingGoal
comment: Reduce sample roughness — which resulted e.g. from previous grinding steps — to get closer to the targeted final roughness.
friendly name: Coarse Roughness Adjustment

Comma
type: NamedIndividual
type: DecimalSeparator
type: Delimiter
friendly name: ,

Composite
type: NamedIndividual
type: MaterialCategory
friendly name: Composite

ContinuousReplenishment
type: NamedIndividual
type: InterfacialMediumSupplyContinuityMethod
friendly name: Continuous

ControTribometerUsePurpose
type: NamedIndividual
type: FilePurpose
friendly name: Control the Tribometer in Use

CoolingGoal
type: NamedIndividual
type: HeatTreatmentGoal
comment: Process step that reduces temperature
friendly name: Cooling

CorundumAbrasiveMaterial
type: NamedIndividual
type: AbrasiveMaterialType
friendly name: Corundum

CounterClockwiseDirection
type: NamedIndividual
type: MotionStartingDirectionSetpoint
type: TurningDirectionSetpoint
friendly name: Counterclockwise

CrFeAlHeatingCoilMethod
type: NamedIndividual
type: TemperatureControlMethod
friendly name: CrFeAl Heating Coil

CupGrindingWheel
type: NamedIndividual
type: GrindingToolType
friendly name: Cup Grinding Wheel

CuttingCoolant1
type: NamedIndividual
type: Coolant
friendly name: Cutting Coolant 1

D181CupGrindingTool
type: NamedIndividual
type: CupGrindingToolID
friendly name: D181

D25CupGrindingTool
type: NamedIndividual
type: CupGrindingToolID
friendly name: D25

D46CupGrindingTool
type: NamedIndividual
type: CupGrindingToolID
friendly name: D46

D91CupGrindingTool
type: NamedIndividual
type: CupGrindingToolID
friendly name: D91

D96CupGrindingTool
type: NamedIndividual
type: CupGrindingToolID
friendly name: D96

DCMotor
type: NamedIndividual
type: MotionDeliveryMethod
friendly name: DC Motor

DCMotorPreloaded
type: NamedIndividual
type: MotionDeliveryMethod
friendly name: DC Motor with a Preloaded Precision Leadscrew

DINEN12198MagneticEmissionStandard
type: NamedIndividual
type: MagneticFieldEmissionClassificationStandard
friendly name: DIN EN 12198

DampenedDeadWeightLoadApplication
type: NamedIndividual
type: LoadApplicationMethod
friendly name: Dead Weight/s (Dampened)

DataProcessingType
type: NamedIndividual
type: Kadi4MatRecordType
friendly name: data processing

DeIonizedWater
type: NamedIndividual
type: SolventTypeName
friendly name: De-Ionized Water

DeadWeightLoadApplication
type: NamedIndividual
type: LoadApplicationMethod
friendly name: Dead Weight/s

DegreeUnit
type: NamedIndividual
type: AngleUnit
friendly name: °

DegreesCelcius
type: NamedIndividual
type: TemperatureUnit
friendly name: °C

DerivedCategory
type: NamedIndividual
type: MeasurementSourceCategory
comment: The values in the time series are dervied from another time series — typical example is the coefficient of friction.
friendly name: Derived

Diamond5micron90degStylus
type: NamedIndividual
type: StylusTipType
friendly name: Diamond 5 µm/90°

DiamondAbrasiveMaterial
type: NamedIndividual
type: AbrasiveMaterialType
friendly name: Diamond

DiamondFixedCleaningAccessory
type: NamedIndividual
type: ToolCleaningAccessoryType
friendly name: Diamond (Fixed Installation)

DifferentialConfiguration
type: NamedIndividual
type: DAQTerminalConfiguration
friendly name: Differential

DiscShape
type: NamedIndividual
type: BlockSpecimenShape
friendly name: Disc

DiscontinuousIrregularToolCleaningTimeInterval
type: NamedIndividual
type: ToolCleaningTimeIntervalType
friendly name: Discontinuous (Irregular Time Interval)

DorfnerSchleifmittelGmbHLeonberg
type: NamedIndividual
type: ManufacturerName
friendly name: Dorfner Schleifmittel GmbH Leonberg

Dot
type: NamedIndividual
type: DecimalSeparator
friendly name: .

DropletMediumWithReplenishmentDelivery
type: NamedIndividual
type: InterfacialMediumSupplyMethod
friendly name: Droplet (with replenishment)

DryCupGrindingTag
type: NamedIndividual
type: Kadi4MatRecordTags
friendly name: dry cup grinding

DryRubCleaning
type: NamedIndividual
type: SpecimenCleaningProcedureType
friendly name: Dry Rub

EK200CupGrindingTool
type: NamedIndividual
type: CupGrindingToolID
friendly name: EK200

EK36CupGrindingTool
type: NamedIndividual
type: CupGrindingToolID
friendly name: EK36

EK80CupGrindingTool
type: NamedIndividual
type: CupGrindingToolID
friendly name: EK80

Eight
type: NamedIndividual
type: BinaryFileValuesSize
friendly name: 8

ElasticSpringLoadApplication
type: NamedIndividual
type: LoadApplicationMethod
friendly name: Elastic Spring

ExchangeableMounting
type: NamedIndividual
type: ProbeArmMountingMethod
friendly name: Exchangeable

ExperimentalObjectType
type: NamedIndividual
type: Kadi4MatRecordType
friendly name: experimental object

Falcon608
type: NamedIndividual
type: ObjectModelName
friendly name: Falcon 608

FinalRoughnessAdjustmentCupGrindingGoal
type: NamedIndividual
type: CupGrindingGoal
comment: The surface finish — minimal removal of waviness and generation of desired level of roughness.
friendly name: Final Roughness Adjustment - Finish

FlatOnFlatContact
type: NamedIndividual
type: PrescribedTypeOfTribologicalContact
comment: The mating surfaces are nominally flat and even.
friendly name: Flat-on-Flat Contact

FloatingPointNumber
type: NamedIndividual
type: DatatypeClass
friendly name: Floating-Point Number

FraunhoferIWMInstitution
type: NamedIndividual
type: ResearchInstitutionName
friendly name: Fraunhofer IWM

FraunhoferIWMLocation
type: NamedIndividual
type: InstitutionLocation
friendly name: Fraunhofer IWM

FriesResearchandTechnologyGmbH
type: NamedIndividual
type: ManufacturerName
friendly name: Fries Research and Technology GmbH

FrontSide
type: NamedIndividual
type: BlockSpecimenOrientationIndicatingFeatureSide
type: BlockSpecimenPrincipalTribologicalSide
friendly name: Front

GMNGeorgMuellerNuernbergAG
type: NamedIndividual
type: ManufacturerName
friendly name: GMN Georg Mueller Nuernberg AG

GandNGenauigkeitsMaschinenbauNuernbergGmbH
type: NamedIndividual
type: ManufacturerName
friendly name: G&N Genauigkeits Maschinenbau Nuernberg GmbH

GluingMounting
type: NamedIndividual
type: BaseSpecimenClampingMethod
type: CounterSpecimenClampingMethod
type: SpecimenClampingMethod
comment: Glue secures a specimen's surface to the equipment's structure.
friendly name: Gluing

GoodfellowCompany
type: NamedIndividual
type: ManufacturerName
friendly name: Goodfellow

Gram
type: NamedIndividual
type: MassUnit
friendly name: g

Grease
type: NamedIndividual
type: InterfacialMediumCategory
friendly name: Grease

GrindingCoolantAralMultrolG100
type: NamedIndividual
type: Coolant
friendly name: Aral Multrol G 100

GrindingCup
type: NamedIndividual
type: GrindingToolType
friendly name: Grinding Cup

GrindingCupCupGrindingTool
type: NamedIndividual
type: CupGrindingToolType
friendly name: Grinding Cup

HV10HardnessMeasurement
type: NamedIndividual
type: HardnessScaleUnit
friendly name: HV10

HV20HardnessMeasurement
type: NamedIndividual
type: HardnessScaleUnit
friendly name: HV20

HardeningHeatTreatment
type: NamedIndividual
type: HeatTreatmentType
comment: A process to increase hardness of a metal. Typically done by heating to a certain temperature and subsequent quenching.
friendly name: Hardening

HaseltalWerkzeugbauUndKunststofftechnikGmbH
type: NamedIndividual
type: ManufacturerName
friendly name: Haseltal Werkzeugbau und Kunststofftechnik GmbH

HeatRodsHeating
type: NamedIndividual
type: TemperatureControlMethod
friendly name: Heat Rods

HeatingGoal
type: NamedIndividual
type: HeatTreatmentGoal
comment: Process step that increases temperature.
friendly name: Heating

HeraeusCompany
type: NamedIndividual
type: ManufacturerName
friendly name: Heraeus

Hertz
type: NamedIndividual
type: FrequencyUnit
friendly name: Hz

HiWi
type: NamedIndividual
type: ProfessionalCapacity
friendly name: HiWi

HommelEtamic
type: NamedIndividual
type: ManufacturerName
friendly name: Hommel-Etamic

Hour
type: NamedIndividual
type: TimeDurationUnit
friendly name: h

HundredCrSix
type: NamedIndividual
type: MaterialName
friendly name: 100Cr6 Steel

IP54IPClass
type: NamedIndividual
type: IPClass
friendly name: IP54

ISO2719FlashPointAcqusitionMethod
type: NamedIndividual
type: FlashPointAcquisitionMethod
friendly name: ISO 2719

ISO4113
type: NamedIndividual
type: ISOStandard
friendly name: 4113

InductiveSensing
type: NamedIndividual
type: SensoringMethod
friendly name: Inductive Sensing

IndustrialProcedureType
type: NamedIndividual
type: Kadi4MatRecordType
friendly name: industrial procedure

Innovatest
type: NamedIndividual
type: ManufacturerName
friendly name: Innovatest

IsopropylAlcoholSolvent
type: NamedIndividual
type: SolventTypeName
friendly name: Isopropyl Alcohol

JumodTRONTemperatureController
type: NamedIndividual
type: TemperatureControlDevice
friendly name: Jumo dTRON 04.1

KITInstitution
type: NamedIndividual
type: ResearchInstitutionName
friendly name: Karlsruhe Institute of Technology (KIT)

KITLocation
type: NamedIndividual
type: InstitutionLocation
friendly name: Karlsruhe Institute of Technology (KIT)

Kelvin
type: NamedIndividual
type: TemperatureUnit
friendly name: K

KennametalInc
type: NamedIndividual
type: ManufacturerName
friendly name: Kennametal Inc.

KiloGram
type: NamedIndividual
type: MassUnit
is1000 of: Gram
friendly name: kg

KiloHertz
type: NamedIndividual
type: FrequencyUnit
friendly name: kHz

KiloMetersPerHour
type: NamedIndividual
type: SpeedUnit
friendly name: km/h

KinematicMountBolt
type: NamedIndividual
type: BaseSpecimenClampingMethod
type: CounterSpecimenClampingMethod
type: SpecimenClampingMethod
comment: A bolt or bolts compressing the specimen directly to a kinematic mount, which in turn is attached to the equipment's structure.
friendly name: Kinematic Mount and Bolt

KinematicMountVise
type: NamedIndividual
type: BaseSpecimenClampingMethod
type: CounterSpecimenClampingMethod
type: SpecimenClampingMethod
comment: A vise compressing the specimen directly to a kinematic mount, which in turn is attached to the equipment's structure.
friendly name: Kinematic Mount and Vise

Kistler
type: NamedIndividual
type: ManufacturerName
friendly name: Kistler

KnoopHardnessMeasurement
type: NamedIndividual
type: HardnessMeasurementType
friendly name: Knoop

KnoopIndeterType
type: NamedIndividual
type: IndenterType
friendly name: Knoop

LEO801
type: NamedIndividual
type: ObjectModelName
friendly name: LEO-801

LEO801UltrasonicCleaner
type: NamedIndividual
type: EquipmentNonSpecificIdentificatoryName
friendly name: LEO-801 Ultrasonic Cleaner

LEOUltrasonicCoLtd
type: NamedIndividual
type: ManufacturerName
friendly name: LEO Ultrasonic Co Ltd

LabEquipmentType
type: NamedIndividual
type: Kadi4MatRecordType
friendly name: lab equipment

LabVIEWSoftware
type: NamedIndividual
type: SoftwareName
friendly name: LabVIEW

LabelOnSpecimen
type: NamedIndividual
type: BlockSpecimenOrientationIndicatingFeatureType
friendly name: Label

LaboratoryBenchVibrationIsolation
type: NamedIndividual
type: VibrationMitigationMethod
friendly name: Lab Bench

LeftSide
type: NamedIndividual
type: BlockSpecimenOrientationIndicatingFeatureSide
type: BlockSpecimenPrincipalTribologicalSide
friendly name: Left

LensShape
type: NamedIndividual
type: BlockSpecimenShape
friendly name: Lens

LineContact
type: NamedIndividual
type: PrescribedTypeOfTribologicalContact
comment: E.g. pressing a cylinder with its curved side on a flat surface.
friendly name: Line Contact

LinearVariableDifferentialTransformerLVDTSensing
type: NamedIndividual
type: SensoringMethod
friendly name: Linear Variable Differential Transformer (LVDT) Sensing

LiterUnit
type: NamedIndividual
type: VolumeUnit
friendly name: l

LittleEndianOrdering
type: NamedIndividual
type: BinaryFileBytesBitsOrder
friendly name: Little-Endian Ordering

LittleEndianOrdering64Bit
type: NamedIndividual
type: BinaryFileBytesBitsOrder
friendly name: Little-Endian Ordering, 64-Bit Long Data Type

LoadingAxis
type: NamedIndividual
type: TribologicalAxisName
friendly name: Loading

M110
type: NamedIndividual
type: ObjectModelName
friendly name: M110

MANTUC2442over91
type: NamedIndividual
type: MANStandard
friendly name: TUC 2442/91

MATLABSoftware
type: NamedIndividual
type: SoftwareName
friendly name: MATLAB

MB
type: NamedIndividual
type: FileSizeUnit
friendly name: MB

MPS2
type: NamedIndividual
type: ObjectModelName
friendly name: MPS 2

MPS2R300
type: NamedIndividual
type: ObjectModelName
friendly name: MPS 2 R300

MW210133
type: NamedIndividual
type: ObjectModelName
friendly name: MW 210-13-3

MagneticDrive
type: NamedIndividual
type: MotionDeliveryMethod
friendly name: Magnetic Drive

MagneticDriveDampenedLoadApplication
type: NamedIndividual
type: LoadApplicationMethod
friendly name: Magnetic Drive (Counterweighed and Dampened)

MagneticDriveLoadApplication
type: NamedIndividual
type: LoadApplicationMethod
friendly name: Magnetic Drive

MagneticMounting
type: NamedIndividual
type: BaseSpecimenClampingMethod
type: CounterSpecimenClampingMethod
type: SpecimenClampingMethod
comment: A magnet secures a specimen's surface to the equipment's structure.
friendly name: Magnetic

ManualDrive
type: NamedIndividual
type: MotionDeliveryMethod
friendly name: Manual Drive

ManualMode
type: NamedIndividual
type: InfeedMode
friendly name: Manual

MasterCandidate
type: NamedIndividual
type: ProfessionalCapacity
friendly name: Master Candidate

MateckCompany
type: NamedIndividual
type: ManufacturerName
friendly name: MaTecK Material-Technologie & Kristalle GmbH

MeasureFrictionForceBasedOnDisplacement
type: NamedIndividual
type: EquipmentRole
friendly name: Measure Load Cell Displacement - Respectively the Friction Force

MeasureWavinessBasedOnHeight
type: NamedIndividual
type: EquipmentRole
friendly name: Measure the Height of the Base Body's Surface of Tribological Interest - Respectively Its Waviness

MeasureWearBasedOnHeight
type: NamedIndividual
type: EquipmentRole
friendly name: Measure the Height of the Counter Body's Bulk - Respectively Its Wear

MeasuredCategory
type: NamedIndividual
type: MeasurementSourceCategory
comment: Values that are acquired by means of DAQ devices.
friendly name: Measured

MegaPascal
type: NamedIndividual
type: PressureUnit
friendly name: MPa

MercedesBenzDBL6513dot00
type: NamedIndividual
type: MercedesBenzStandard
friendly name: DBL 6513.00

MetaDataPurpose
type: NamedIndividual
type: FilePurpose
friendly name: Metadata

Metal
type: NamedIndividual
type: MaterialCategory
friendly name: Metal

MeterUnit
type: NamedIndividual
type: DistanceUnit
friendly name: m

MetersPerSecond
type: NamedIndividual
type: SpeedUnit
friendly name: m/s

MicroEpsilon
type: NamedIndividual
type: ManufacturerName
friendly name: Micro-Epsilon

MicroProf
type: NamedIndividual
type: ObjectModelName
friendly name: MicroProf

MicronUnit
type: NamedIndividual
type: DistanceUnit
friendly name: µm

MicronsPerSecond
type: NamedIndividual
type: SpeedUnit
friendly name: µm/s

MicronsPerVoltUnit
type: NamedIndividual
type: ConversionUnit
friendly name: µm/V

MiliLiterUnit
type: NamedIndividual
type: VolumeUnit
friendly name: ml

MilimeterPerSecond
type: NamedIndividual
type: SpeedUnit
friendly name: mm/s

MilliMeterUnit
type: NamedIndividual
type: DistanceUnit
friendly name: mm

Minute
type: NamedIndividual
type: TimeDurationUnit
friendly name: min

MotionControl
type: NamedIndividual
type: EquipmentRole
friendly name: Motion Control

MotorizedLeadscrewLoadApplication
type: NamedIndividual
type: LoadApplicationMethod
friendly name: Stepper and Lead Screw

MultiCharge5019A
type: NamedIndividual
type: ObjectModelName
friendly name: Multi Charge Amplifier Type 5019A

MultiLoadCellLoadApplication
type: NamedIndividual
type: LoadApplicationMethod
friendly name: Multi Load Cell

NanoMeterUnit
type: NamedIndividual
type: DistanceUnit
friendly name: nm

NationalInstruments
type: NamedIndividual
type: ManufacturerName
friendly name: National Instruments

NewtonPerVoltUnit
type: NamedIndividual
type: ConversionUnit
friendly name: N/V

NewtonUnit
type: NamedIndividual
type: ForceUnit
friendly name: N

NineDotSeven
type: NamedIndividual
type: SoftwareVersion
friendly name: 9.7

NonExistantMethod
type: NamedIndividual
type: DeliveryMethod
type: HousingMethod
type: SurroundingMediumContolMethod
friendly name: None

NonWovenCloth
type: NamedIndividual
type: EquipmentNonSpecificIdentificatoryName
friendly name: Nonwoven Cloth - Type 520304, Fa. Tork, Mannheim, Germany

NullUnit
type: NamedIndividual
type: MagnificationUnit
comment: Equvallent to not entering any value - the preferred solution. Usually denotes a proportion - like "times" something, for example, magnification; or some type of count a count.
friendly name: null

OFECopper
type: NamedIndividual
type: MaterialName
friendly name: OFE Copper

OFHCCopper
type: NamedIndividual
type: MaterialName
friendly name: OFHC Copper

Oil
type: NamedIndividual
type: InterfacialMediumCategory
friendly name: Oil

OilSurroundingMedium
type: NamedIndividual
type: SurroundingMediumType
friendly name: Oil

OneOverMinuteUnit
type: NamedIndividual
type: FrequencyUnit
friendly name: 1/min

OpenBathSubmersion
type: NamedIndividual
type: DeliveryMethod
friendly name: Open Bath

OpenCycleFreshMediumReplenishment
type: NamedIndividual
type: InterfacialMediumSourcingMethod
friendly name: Open Cycle - Fresh Medium

OptoSigma
type: NamedIndividual
type: ManufacturerName
friendly name: OptoSigma

OverviewCameraView
type: NamedIndividual
type: CameraViewType
friendly name: Overview Camera

PCI
type: NamedIndividual
type: DAQInterfaceName
friendly name: PCI

PI
type: NamedIndividual
type: ManufacturerName
friendly name: Physik Instumente (PI) GmbH & Co. KG

Pascal
type: NamedIndividual
type: PressureUnit
friendly name: Pa

PelletShape
type: NamedIndividual
type: BlockSpecimenShape
friendly name: Pellet

PercentRHPerVoltUnit
type: NamedIndividual
type: ConversionUnit
friendly name: %/V

PercentRelativeHumidy
type: NamedIndividual
type: RelativeHumidityUnit
comment: This reads as % Relative Humidity, but "% RH" is not SI unit, so it is kept just as "%".
friendly name: %

PercentUnit
type: NamedIndividual
type: FractionUnit
friendly name: %

PhDCandidate
type: NamedIndividual
type: ProfessionalCapacity
friendly name: PhD Candidate

PiezoDrive
type: NamedIndividual
type: MotionDeliveryMethod
friendly name: Piezo Drive

PiezoElectricLoadApplication
type: NamedIndividual
type: LoadApplicationMethod
friendly name: Piezo Electric

PinonDiscMachine
type: NamedIndividual
type: ObjectModelName
friendly name: Pin-on-Disc Machine

PlateShape
type: NamedIndividual
type: BlockSpecimenShape
friendly name: Plate

PneumaticDrive
type: NamedIndividual
type: MotionDeliveryMethod
friendly name: Pneumatic Drive

PneumaticLoadApplication
type: NamedIndividual
type: LoadApplicationMethod
friendly name: Pneumatic

PointContact
type: NamedIndividual
type: PrescribedTypeOfTribologicalContact
comment: The type of contact that forms when a convex spherical (or aspherical) curved object is pressed against a flat surface or another convex shaped object.
friendly name: Point Contact

PolyJeanPolyesterCloth
type: NamedIndividual
type: EquipmentNonSpecificIdentificatoryName
friendly name: Poly-Jean Polyester Cloth

Polymer
type: NamedIndividual
type: MaterialCategory
friendly name: Polymer

PorousAluminaHardCleaningAccessory
type: NamedIndividual
type: ToolCleaningAccessoryType
friendly name: Porous Alumina (Hard)

PorousAluminaSoftAndHardCleaningAccessory
type: NamedIndividual
type: ToolCleaningAccessoryType
friendly name: Porous Alumina (Soft Followed by Hard)

PorousAluminaSoftCleaningAccessory
type: NamedIndividual
type: ToolCleaningAccessoryType
friendly name: Porous Alumina (Soft)

Postdoc
type: NamedIndividual
type: ProfessionalCapacity
friendly name: Postdoc

PreProcessCleaningGoal
type: NamedIndividual
type: CupGrindingGoal
friendly name: Pre-Process Cleaning

PrincipalInvestigator
type: NamedIndividual
type: ProfessionalCapacity
friendly name: Principal Investigator

PrivateVisibility
type: NamedIndividual
type: Kadi4MatRecordVisibility
friendly name: Private

ProcessType
type: NamedIndividual
type: Kadi4MatRecordType
friendly name: Process

ProcessedDataPurpose
type: NamedIndividual
type: FilePurpose
friendly name: (Human Readable) Processed Data

Professor
type: NamedIndividual
type: ProfessionalCapacity
friendly name: Professor

PublicVisibility
type: NamedIndividual
type: Kadi4MatRecordVisibility
friendly name: Public

QuenchingGoal
type: NamedIndividual
type: HeatTreatmentGoal
comment: Process step intended to cool a metal at a rapid rate. This is most often done to produce a martensite transformation. Depending on the alloy and other considerations (such as concern for maximum hardness vs. cracking and distortion), cooling may be done with forced air or other gases, (such as nitrogen). Liquids may be used, due to their better thermal conductivity, such as oil or water.
friendly name: Quenching

R1000
type: NamedIndividual
type: ObjectModelName
friendly name: R1000

RSEConfiguration
type: NamedIndividual
type: DAQTerminalConfiguration
friendly name: RSE

RawDataPurpose
type: NamedIndividual
type: FilePurpose
friendly name: Raw Data

ReciprocatingMotion
type: NamedIndividual
type: TribologicalMotionType
friendly name: Reciprocating

ReduceWavinessCupGrindingGoal
type: NamedIndividual
type: CupGrindingGoal
comment: Get a flat surface. Done with a coarse grinding tool typically.
friendly name: Reduce Waviness

RemoveScaleLayerCupGrindingGoal
type: NamedIndividual
type: CupGrindingGoal
friendly name: Remove Scale Layer

RevolutionsPerMinute
type: NamedIndividual
type: AngularVelocityUnit
friendly name: 1/min

RightSide
type: NamedIndividual
type: BlockSpecimenOrientationIndicatingFeatureSide
type: BlockSpecimenPrincipalTribologicalSide
friendly name: Right

RinsingCleaning
type: NamedIndividual
type: SpecimenCleaningProcedureType
comment: The process of rinsing the sample's surface with a jet of liquid medium.
friendly name: Rinsing

RodShape
type: NamedIndividual
type: BlockSpecimenShape
friendly name: Rod

Room316a
type: NamedIndividual
type: Room
friendly name: 316a

RoomR002
type: NamedIndividual
type: Room
friendly name: 002

RoomR005
type: NamedIndividual
type: Room
friendly name: 005

RoomR006
type: NamedIndividual
type: Room
friendly name: 006

RoomR010
type: NamedIndividual
type: Room
friendly name: 010

RoomR012
type: NamedIndividual
type: Room
friendly name: 012

RoomS3dot05
type: NamedIndividual
type: Room
friendly name: S3.05

RoughnessTag
type: NamedIndividual
type: Kadi4MatRecordTags
friendly name: roughness

RubberBallAirBlower
type: NamedIndividual
type: EquipmentNonSpecificIdentificatoryName
friendly name: Air Blower Rubber Ball

SAEJ967D
type: NamedIndividual
type: SAEStandard
friendly name: J967D

SawingBladeType1
type: NamedIndividual
type: SawingBlade
friendly name: Sawing Blade Type 1

ScanTopographyRole
type: NamedIndividual
type: EquipmentRole
friendly name: Scan Topography

ScientificProcedureType
type: NamedIndividual
type: Kadi4MatRecordType
friendly name: scientific procedure

ScratchMark
type: NamedIndividual
type: BlockSpecimenOrientationIndicatingFeatureType
friendly name: Scratch Mark

Second
type: NamedIndividual
type: TimeDurationUnit
friendly name: s

SensorCalibrationValuesPurpose
type: NamedIndividual
type: FilePurpose
friendly name: Sensor Calibration Values

ShellCompany
type: NamedIndividual
type: ManufacturerName
friendly name: Shell

SiCAbrasiveMaterial
type: NamedIndividual
type: AbrasiveMaterialType
friendly name: SiC

SiCFormula
type: NamedIndividual
type: MaterialEmpiricalFormula
friendly name: SiC

SignalRecording
type: NamedIndividual
type: EquipmentRole
friendly name: Signal Recording

SignedInteger
type: NamedIndividual
type: DatatypeClass
friendly name: Signed Integer

SixDotOne
type: NamedIndividual
type: SoftwareVersion
friendly name: 6.1

SixHundredEightyOne
type: NamedIndividual
type: Building
friendly name: 681

Sixteen
type: NamedIndividual
type: BinaryFileValuesSize
friendly name: 16

SixtyFour
type: NamedIndividual
type: BinaryFileValuesSize
friendly name: 64

SlidingAxis
type: NamedIndividual
type: TribologicalAxisName
friendly name: Sliding

SoftwareGeneratedCategory
type: NamedIndividual
type: MeasurementSourceCategory
comment: Values that originate from the software (e.g. time stamps, cycle number indicating values, test programm step numbers etc.)
friendly name: Software-Generated

SolventInterfacialMedium
type: NamedIndividual
type: InterfacialMediumCategory
friendly name: Solvent

SpecimenContainerDelivery
type: NamedIndividual
type: SpecimenDeliveryMethod
friendly name: Specimen Container

SphereShape
type: NamedIndividual
type: BlockSpecimenShape
friendly name: Sphere

StoneTableActiveDampersVibrationIsolation
type: NamedIndividual
type: VibrationMitigationMethod
friendly name: Stone Table with Active Pneumatic Dampers

StoneTablePassiveDampersVibrationIsolation
type: NamedIndividual
type: VibrationMitigationMethod
friendly name: Stone Table with Passive Pneumatic Dampers

StoneTableVibrationIsolation
type: NamedIndividual
type: VibrationMitigationMethod
friendly name: Stone Table

StrainGaugeMeasuringPrinciple
type: NamedIndividual
type: SensoringMethod
friendly name: Strain Gauge

T8000R120400
type: NamedIndividual
type: ObjectModelName
friendly name: T8000 R120-400

TapeMounting
type: NamedIndividual
type: BaseSpecimenClampingMethod
type: CounterSpecimenClampingMethod
type: SpecimenClampingMethod
comment: Double-sided tape secures the specimen's bottom surface to the equipment's structure.
friendly name: Double-sided Tape

Technician
type: NamedIndividual
type: ProfessionalCapacity
friendly name: Technician

TemperingHeatTreatment
type: NamedIndividual
type: HeatTreatmentType
comment: Tempering is a process of heat treating, which is used to increase the toughness of iron-based alloys. It is usually performed after hardening, to reduce some of the excess hardness, and is done by heating the metal to some temperature below the critical point for a certain period of time, then allowing it to cool in still air.
friendly name: Tempering

TestProgramPurpose
type: NamedIndividual
type: FilePurpose
friendly name: Test Program (Set of Operating Points)

ThirtyDotFourtyEight
type: NamedIndividual
type: Building
friendly name: MZE, 30.48

ThirtyDotFourtyNine
type: NamedIndividual
type: Building
friendly name: μTC, 30.49

ThirtyTwo
type: NamedIndividual
type: BinaryFileValuesSize
friendly name: 32

TopSide
type: NamedIndividual
type: BlockSpecimenOrientationIndicatingFeatureSide
type: BlockSpecimenPrincipalTribologicalSide
friendly name: Top

TransverseAxis
type: NamedIndividual
type: TribologicalAxisName
friendly name: Transverse

Two11dash15slash16
type: NamedIndividual
type: ObjectModelName
friendly name: 211-15/16

TwoOneOneZero
type: NamedIndividual
type: ObjectModelName
friendly name: 2110

USB
type: NamedIndividual
type: DAQInterfaceName
friendly name: USB

USB6212
type: NamedIndividual
type: ObjectModelName
friendly name: USB-6212

UltrasocincCleaning
type: NamedIndividual
type: SpecimenCleaningProcedureType
comment: The process of ultrasonic cleaning a sample immersed in a liquid medium (solvent).
friendly name: Ultrasonic Cleaning

UnidirectionalCurvedMotion
type: NamedIndividual
type: TribologicalMotionType
friendly name: Curved Unidirectional

UnidirectionalLinearMotion
type: NamedIndividual
type: TribologicalMotionType
friendly name: Linear Unidirectional

UniformSampleHeightCupGrindingGoal
type: NamedIndividual
type: CupGrindingGoal
comment: First step of grinding. The grinding tool will typically start to abrade at merely one point of the surface. After this process step, the whole surface is being abraded.
friendly name: Uniform Sample Height

UsignedIntereger
type: NamedIndividual
type: DatatypeClass
friendly name: Unsigned Integer

V1404
type: NamedIndividual
type: ObjectModelName
friendly name: V 1404

VacuumMounting
type: NamedIndividual
type: BaseSpecimenClampingMethod
type: CounterSpecimenClampingMethod
type: SpecimenClampingMethod
comment: The end of a vacuum line is directly attached to specimen's surface to keep it attached to a piece of equipment.
friendly name: Vacuum

VickersHardnessMeasurement
type: NamedIndividual
type: HardnessMeasurementType
friendly name: Vickers

VickersIndenterType
type: NamedIndividual
type: IndenterType
friendly name: Vickers

ViseMounting
type: NamedIndividual
type: BaseSpecimenClampingMethod
type: CounterSpecimenClampingMethod
type: SpecimenClampingMethod
comment: A vise mechanism compressing the base body's side surfaces to secure them to the machinery's construction.
friendly name: Vise

Volt
type: NamedIndividual
type: VoltageUnit
friendly name: V

WCNi
type: NamedIndividual
type: MaterialName
friendly name: WC-Ni

WagnerMagnete
type: NamedIndividual
type: ManufacturerName
friendly name: Wagner Magnete

Watt
type: NamedIndividual
type: PowerUnit
friendly name: W

WhitelightInterferometry
type: NamedIndividual
type: SensoringMethod
friendly name: White Light Interferometry

Windows98
type: NamedIndividual
type: OperatingSystemName
friendly name: Windows 98

WipingCleaning
type: NamedIndividual
type: SpecimenCleaningProcedureType
comment: The process of wiping the sample's surface with some kind of tissue/fabric. Can involve a liquid medium (solvent).
friendly name: Wiping

Z16758
type: NamedIndividual
type: ObjectModelName
friendly name: Z 16758

Info
type: NamedIndividual
comment: When entering individuals, do not use dots, dashes in the names, or don't begin them with a number.

ai0
type: NamedIndividual
type: DAQPortName
friendly name: ai0

ai1
type: NamedIndividual
type: DAQPortName
friendly name: ai1

ai2
type: NamedIndividual
type: DAQPortName
friendly name: ai2

ai3
type: NamedIndividual
type: DAQPortName
friendly name: ai3

ai4
type: NamedIndividual
type: DAQPortName
friendly name: ai4

ai6
type: NamedIndividual
type: DAQPortName
friendly name: ai6

ao0
type: NamedIndividual
type: DAQPortName
friendly name: ao0

binFileType
type: NamedIndividual
type: FileType
friendly name: *.bin

csvFileType
type: NamedIndividual
type: FileType
friendly name: *.csv

gfUnit
type: NamedIndividual
type: ForceUnit
comment: gram force
friendly name: gf

kB
type: NamedIndividual
type: FileSizeUnit
friendly name: kB

kgPerm3
type: NamedIndividual
type: MassDensityUnit
friendly name: kg/m^3

kgfUnit
type: NamedIndividual
type: ForceUnit
comment: kg force
friendly name: kgf

mbarUnit
type: NamedIndividual
type: PressureUnit
friendly name: mbar

mlPerHourUnit
type: NamedIndividual
type: VolumetricRateUnit
friendly name: ml/h

mm2PerS
type: NamedIndividual
type: KinematicViscosityUnit
friendly name: mm^2/s

txtFileType
type: NamedIndividual
type: FileType
friendly name: *.txt